log_file.txt

download

20 lgp_sign=yes
lgp_suffix=yes<br/>10 Running lgp build -v -s yes -r /tmp/tmp3xvLni/common/.. --suffix ~revf3ab15166db9<br/>10 use setup package class format: PackageInfo<br/>10 guessing distribution(s): jessie, epel-7-x86_64, trusty, sid<br/>10 run subprocess command: python setup.py --name<br/>10 run subprocess command: python setup.py --version<br/>10 retrieve debian version from debian/changelog: 1.3.0-1<br/>20 create pristine tarball from working directory<br/>10 run subprocess command: python setup.py -q sdist -d /tmp/tmpVaPtIP<br/>10 command substitutions: {&#39;dist_dir&#39;: &#39;/tmp/tmpVaPtIP&#39;}<br/>20 Attempting to build jessie<br/>10 Going back to /tmp/tmp3xvLni/common<br/>10 copy pristine tarball to prepare Debian source package diff<br/>10 extracting original source archive for jessie distribution in /tmp/tmpjIFROk<br/>10 suffix &#39;~revf3ab15166db9&#39; added to package version<br/>20 Debian source package (format: 1.0) for &#39;jessie&#39;<br/>10 running dpkg-source command: dpkg-source --no-copy -b /tmp/tmpjIFROk/logilab-common-1.3.0 ...<br/>20 create Debian source package files (.dsc, .diff.gz): logilab-common_1.3.0-1~revf3ab15166db9.dsc<br/>20 this build is arch-independent. Lgp will only build on architecture amd64<br/>10 changing build context... (/tmp/tmpGQEU5n)<br/>10 package builder flavour: &#39;pbuilder&#39;<br/>20 building binary debian package for &#39;jessie/amd64&#39; using DEBBUILDOPTS options: &#39;(none)&#39; ...<br/>10 running build command: sudo IMAGE=/var/cache/lgp/buildd/jessie-amd64.tgz DIST=jessie ARCH=amd64 pbuilder build --configfile /etc/lgp/pbuilderrc --buildresult /tmp/tmpGQEU5n --hookdir /var/lib/logilab-packaging/hooks /tmp/tmpjIFROk/logilab-common_1.3.0-1~revf3ab15166db9.dsc ...<br/>50 binary build(s) failed for &#39;jessie&#39; with exit status 1<br/>20 a build logfile is available: /tmp/tmp3xvLni/jessie/logilab-common_1.3.0-1~revf3ab15166db9_amd64_jessie.lgp-build.log<br/>20 Attempting to build epel-7-x86_64<br/>10 Going back to /tmp/tmp3xvLni/common<br/>10 running mock command: sudo mock --buildsrpm --spec /tmp/tmp3xvLni/common/python-logilab-common.spec --resultdir /tmp/tmpE_0cl1 -r epel-7-x86_64 --uniqueext 4888 --sources /tmp/tmpVaPtIP ...<br/>10 running mock command: sudo mock -r epel-7-x86_64 --resultdir /tmp/tmpE_0cl1 --uniqueext 4888 --rebuild /tmp/tmpE_0cl1/python-logilab-common-1.3.0-logilab.1.el7.centos~revf3ab15166db9.src.rpm ...<br/>20 a build logfile is available: /tmp/tmp3xvLni/epel-7-x86_64/state.log<br/>20 a build logfile is available: /tmp/tmp3xvLni/epel-7-x86_64/root.log<br/>20 a build logfile is available: /tmp/tmp3xvLni/epel-7-x86_64/build.log<br/>20 Attempting to build trusty<br/>10 Going back to /tmp/tmp3xvLni/common<br/>10 copy pristine tarball to prepare Debian source package diff<br/>10 extracting original source archive for trusty distribution in /tmp/tmp8Mazfz<br/>10 suffix &#39;~revf3ab15166db9&#39; added to package version<br/>20 Debian source package (format: 1.0) for &#39;trusty&#39;<br/>10 running dpkg-source command: dpkg-source --no-copy -b /tmp/tmp8Mazfz/logilab-common-1.3.0 ...<br/>20 create Debian source package files (.dsc, .diff.gz): logilab-common_1.3.0-1~revf3ab15166db9.dsc<br/>20 this build is arch-independent. Lgp will only build on architecture amd64<br/>10 changing build context... (/tmp/tmplb8J3z)<br/>10 package builder flavour: &#39;pbuilder&#39;<br/>20 building binary debian package for &#39;trusty/amd64&#39; using DEBBUILDOPTS options: &#39;(none)&#39; ...<br/>10 running build command: sudo IMAGE=/var/cache/lgp/buildd/trusty-amd64.tgz DIST=trusty ARCH=amd64 pbuilder build --configfile /etc/lgp/pbuilderrc --buildresult /tmp/tmplb8J3z --hookdir /var/lib/logilab-packaging/hooks /tmp/tmp8Mazfz/logilab-common_1.3.0-1~revf3ab15166db9.dsc ...<br/>50 binary build(s) failed for &#39;trusty&#39; with exit status 1<br/>20 a build logfile is available: /tmp/tmp3xvLni/trusty/logilab-common_1.3.0-1~revf3ab15166db9_amd64_trusty.lgp-build.log<br/>20 Attempting to build sid<br/>10 Going back to /tmp/tmp3xvLni/common<br/>10 copy pristine tarball to prepare Debian source package diff<br/>10 extracting original source archive for sid distribution in /tmp/tmpexA2rv<br/>10 suffix &#39;~revf3ab15166db9&#39; added to package version<br/>20 Debian source package (format: 1.0) for &#39;sid&#39;<br/>10 running dpkg-source command: dpkg-source --no-copy -b /tmp/tmpexA2rv/logilab-common-1.3.0 ...<br/>20 create Debian source package files (.dsc, .diff.gz): logilab-common_1.3.0-1~revf3ab15166db9.dsc<br/>20 this build is arch-independent. Lgp will only build on architecture amd64<br/>10 changing build context... (/tmp/tmpz4MeJH)<br/>10 package builder flavour: &#39;pbuilder&#39;<br/>20 building binary debian package for &#39;sid/amd64&#39; using DEBBUILDOPTS options: &#39;(none)&#39; ...<br/>10 running build command: sudo IMAGE=/var/cache/lgp/buildd/sid-amd64.tgz DIST=sid ARCH=amd64 pbuilder build --configfile /etc/lgp/pbuilderrc --buildresult /tmp/tmpz4MeJH --hookdir /var/lib/logilab-packaging/hooks /tmp/tmpexA2rv/logilab-common_1.3.0-1~revf3ab15166db9.dsc ...<br/>50 binary build(s) failed for &#39;sid&#39; with exit status 1<br/>20 a build logfile is available: /tmp/tmp3xvLni/sid/logilab-common_1.3.0-1~revf3ab15166db9_amd64_sid.lgp-build.log<br/>20 recent files from build:
* /tmp/tmp3xvLni/epel-7-x86_64/build.log
* /tmp/tmp3xvLni/epel-7-x86_64/python-logilab-common-1.3.0-logilab.1.el7.centos~revf3ab15166db9.noarch.rpm
* /tmp/tmp3xvLni/epel-7-x86_64/python-logilab-common-1.3.0-logilab.1.el7.centos~revf3ab15166db9.src.rpm
* /tmp/tmp3xvLni/epel-7-x86_64/root.log
* /tmp/tmp3xvLni/epel-7-x86_64/state.log
* /tmp/tmp3xvLni/jessie/logilab-common_1.3.0-1~revf3ab15166db9_amd64_jessie.lgp-build.log
* /tmp/tmp3xvLni/sid/logilab-common_1.3.0-1~revf3ab15166db9_amd64_sid.lgp-build.log
* /tmp/tmp3xvLni/trusty/logilab-common_1.3.0-1~revf3ab15166db9_amd64_trusty.lgp-build.log<br/>20 begin scanning for log files <br/>20 printing /tmp/tmp3xvLni/common/../trusty/logilab-common_1.3.0-1~revf3ab15166db9_amd64_trusty.lgp-build.log: [0mI: Using pkgname logfile [0m

[0mI: Current time: Fri Nov 18 13:11:11 CET 2016 [0m

[0mI: pbuilder-time-stamp: 1479471071 [0m

[0mI: Obtaining the cached apt archive contents [0m

[0mI: Installing the build-deps [0m

[0mI: user script /var/cache/pbuilder/build/10370/tmp/hooks/D10tmp starting [0m

[0mI: user script /var/cache/pbuilder/build/10370/tmp/hooks/D10tmp finished [0m

[0mI: user script /var/cache/pbuilder/build/10370/tmp/hooks/D50debconf starting [0m

[0mI: user script /var/cache/pbuilder/build/10370/tmp/hooks/D50debconf finished [0m

[0mI: user script /var/cache/pbuilder/build/10370/tmp/hooks/D99apt starting [0m

+ apt-get update

W: GPG error: http://security.ubuntu.com trusty-security InRelease: The following signatures couldn&#39;t be verified because the public key is not available: NO_PUBKEY 40976EAF437D05B5 NO_PUBKEY 3B4FE6ACC0B21F32

W: An error occurred during the signature verification. The repository is not updated and the previous index files will be used. GPG error: http://archive.ubuntu.com trusty-updates InRelease: The following signatures couldn&#39;t be verified because the public key is not available: NO_PUBKEY 40976EAF437D05B5 NO_PUBKEY 3B4FE6ACC0B21F32

W: GPG error: http://archive.ubuntu.com trusty Release: The following signatures couldn&#39;t be verified because the public key is not available: NO_PUBKEY 40976EAF437D05B5 NO_PUBKEY 3B4FE6ACC0B21F32

W: Failed to fetch http://archive.ubuntu.com/ubuntu/dists/trusty-updates/InRelease

W: Some index files failed to download. They have been ignored, or old ones used instead.

[0mI: user script /var/cache/pbuilder/build/10370/tmp/hooks/D99apt finished [0m

-&gt; Attempting to satisfy build-dependencies

-&gt; Creating pbuilder-satisfydepends-dummy package

Package: pbuilder-satisfydepends-dummy

Version: 0.invalid.0

Architecture: amd64

Maintainer: Debian Pbuilder Team &lt;pbuilder-maint@lists.alioth.debian.org&gt;

Description: Dummy package to satisfy dependencies with aptitude - created by pbuilder

This package was created automatically by pbuilder to satisfy the

build-dependencies of the package being currently built.

Depends: debhelper (&gt;= 8), python-all, python-setuptools, python3-all, python3-setuptools, python-epydoc, graphviz, python-unittest2, python-egenix-mxdatetime, python-tz, python3-tz | python3 (&lt;&lt; 3.3), python-six (&gt;= 1.4.0), python3-six (&gt;= 1.4.0) | python3 (&lt;&lt; 3.3)

dpkg-deb: building package `pbuilder-satisfydepends-dummy&#39; in `/tmp/satisfydepends-aptitude/pbuilder-satisfydepends-dummy.deb&#39;.

Selecting previously unselected package pbuilder-satisfydepends-dummy.

(Reading database ... 12333 files and directories currently installed.)

Preparing to unpack .../pbuilder-satisfydepends-dummy.deb ...

Unpacking pbuilder-satisfydepends-dummy (0.invalid.0) ...

dpkg: pbuilder-satisfydepends-dummy: dependency problems, but configuring anyway as you requested:

pbuilder-satisfydepends-dummy depends on debhelper (&gt;= 8); however:

Package debhelper is not installed.

pbuilder-satisfydepends-dummy depends on python-all; however:

Package python-all is not installed.

pbuilder-satisfydepends-dummy depends on python-setuptools; however:

Package python-setuptools is not installed.

pbuilder-satisfydepends-dummy depends on python3-all; however:

Package python3-all is not installed.

pbuilder-satisfydepends-dummy depends on python3-setuptools; however:

Package python3-setuptools is not installed.

pbuilder-satisfydepends-dummy depends on python-epydoc; however:

Package python-epydoc is not installed.

pbuilder-satisfydepends-dummy depends on graphviz; however:

Package graphviz is not installed.

pbuilder-satisfydepends-dummy depends on python-unittest2; however:

Package python-unittest2 is not installed.

pbuilder-satisfydepends-dummy depends on python-egenix-mxdatet

Setting up pbuilder-satisfydepends-dummy (0.invalid.0) ...

Reading package lists...

Building dependency tree...

Reading state information...

Initializing package states...

Writing extended state information...

The following NEW packages will be installed:

bsdmainutils{a} debhelper{a} dh-apparmor{a} dh-python{a} file{a}

fontconfig{a} fontconfig-config{a} fonts-dejavu-core{a} gettext{a}

gettext-base{a} graphviz{a} groff-base{a} intltool-debian{a}

libasprintf0c2{a} libcairo2{a} libcdt5{a} libcgraph6{a} libcroco3{a}

libdatrie1{a} libexpat1{a} libffi6{a} libfontconfig1{a} libfreetype6{a}

libgd3{a} libglib2.0-0{a} libgraphite2-3{a} libgvc6{a} libgvpr2{a}

libharfbuzz0b{a} libice6{a} libjbig0{a} libjpeg-turbo8{a} libjpeg8{a}

libltdl7{a} libmagic1{a} libpango-1.0-0{a} libpangocairo-1.0-0{a}

libpangoft2-1.0-0{a} libpathplan4{a} libpipeline1{a} libpixman-1-0{a}

libpython-stdlib{a} libpython2.7-minimal{a} libpython2.7-stdlib{a}

libpython3-stdlib{a} libpython3.4-minimal{a} libpython3.4-stdlib{a}

libsm6{a} libthai-data{a} libthai0{a} libtiff5{a} libunistring0{a}

libvpx1{a} libx11-6{a} libx11-data{a} libxau6{a} libxaw7{a}

libxcb-render0{a} libxcb-shm0{a} libxcb1{a} libxdmcp6{a} libxext6{a}

libxml2{a} libxmu6{a} libxpm4{a} libxrender1{a} libxt6{a} man-db{a}

mime-support{a} po-debconf{a} python{a} python-all{a}

python-egenix-mxdatetime{a} python-egenix-mxtools{a} python-epydoc{a}

python-minimal{a} python-pkg-resources{a} python-setuptools{a}

python-six{a} python-tz{a} python-unittest2{a} python2.7{a}

python2.7-minimal{a} python3{a} python3-all{a} python3-minimal{a}

python3-pkg-resources{a} python3-setuptools{a} python3-six{a}

python3-tz{a} python3.4{a} python3.4-minimal{a} ucf{a} x11-common{a}

0 packages upgraded, 94 newly installed, 0 to remove and 8 not upgraded.

Need to get 21.5 MB of archives. After unpacking 85.5 MB will be used.

WARNING: untrusted versions of the following packages will be installed!

Untrusted packages could compromise your system&#39;s security.

You should only proceed with the installation if you are certain that

this is what you want to do.

python3 bsdmainutils libjpeg-turbo8 libxau6 python-minimal libxaw7

libice6 libltdl7 python-all libfontconfig1 libsm6 python-egenix-mxtools

python-unittest2 groff-base libx11-data libxcb1 libpipeline1 fontconfig

intltool-debian debhelper libxt6 libvpx1 libxcb-render0 fontconfig-config

libthai0 libharfbuzz0b libgd3 libpython3-stdlib python3-all libxdmcp6

python3-minimal libthai-data libunistring0 po-debconf libcroco3

libxcb-shm0 python libxmu6 libpython-stdlib python-epydoc ucf libdatrie1

python-egenix-mxdatetime fonts-dejavu-core libx11-6 libxpm4 libjpeg8

Do you want to ignore this warning and proceed anyway?

To continue, enter &quot;Yes&quot;; to abort, enter &quot;No&quot;: Abort.

[0;31mE: pbuilder-satisfydepends failed. [0m

[0mI: Copying back the cached apt archive contents [0m

[0mI: unmounting /sys filesystem [0m

[0mI: unmounting /dev filesystem [0m

[0mI: unmounting dev/pts filesystem [0m

[0mI: unmounting run/shm filesystem [0m

[0mI: unmounting proc filesystem [0m

[0mI: unmounting sys filesystem [0m

[0mI: cleaning the build env [0m

[0mI: removing directory /var/cache/pbuilder/build/10370 and its subdirectories [0m
<br/>20 printing /tmp/tmp3xvLni/common/../sid/logilab-common_1.3.0-1~revf3ab15166db9_amd64_sid.lgp-build.log: [0mI: Using pkgname logfile [0m

[0mI: Current time: Fri Nov 18 13:11:23 CET 2016 [0m

[0mI: pbuilder-time-stamp: 1479471083 [0m

[0mI: Obtaining the cached apt archive contents [0m

[0mI: Installing the build-deps [0m

[0mI: user script /var/cache/pbuilder/build/10916/tmp/hooks/D10tmp starting [0m

[0mI: user script /var/cache/pbuilder/build/10916/tmp/hooks/D10tmp finished [0m

[0mI: user script /var/cache/pbuilder/build/10916/tmp/hooks/D50debconf starting [0m

[0mI: user script /var/cache/pbuilder/build/10916/tmp/hooks/D50debconf finished [0m

[0mI: user script /var/cache/pbuilder/build/10916/tmp/hooks/D99apt starting [0m

+ apt-get update

W: http://download.logilab.org/acceptance/sid/Release.gpg: Signature by key 7CC634AC5D4195838A0348387E04E635163B23A2 uses weak digest algorithm (SHA1)

W: http://download.logilab.org/backports/dists/sid/Release.gpg: Signature by key 2AD2C8EB3FFBA107EE7B8DCA4DC23770D192C8C5 uses weak digest algorithm (SHA1)

[0mI: user script /var/cache/pbuilder/build/10916/tmp/hooks/D99apt finished [0m

-&gt; Attempting to satisfy build-dependencies

-&gt; Creating pbuilder-satisfydepends-dummy package

Package: pbuilder-satisfydepends-dummy

Version: 0.invalid.0

Architecture: amd64

Maintainer: Debian Pbuilder Team &lt;pbuilder-maint@lists.alioth.debian.org&gt;

Description: Dummy package to satisfy dependencies with aptitude - created by pbuilder

This package was created automatically by pbuilder to satisfy the

build-dependencies of the package being currently built.

Depends: debhelper (&gt;= 8), python-all, python-setuptools, python3-all, python3-setuptools, python-epydoc, graphviz, python-unittest2, python-egenix-mxdatetime, python-tz, python3-tz | python3 (&lt;&lt; 3.3), python-six (&gt;= 1.4.0), python3-six (&gt;= 1.4.0) | python3 (&lt;&lt; 3.3)

dpkg-deb: building package &#39;pbuilder-satisfydepends-dummy&#39; in &#39;/tmp/satisfydepends-aptitude/pbuilder-satisfydepends-dummy.deb&#39;.

Selecting previously unselected package pbuilder-satisfydepends-dummy.

(Reading database ... 13671 files and directories currently installed.)

Preparing to unpack .../pbuilder-satisfydepends-dummy.deb ...

Unpacking pbuilder-satisfydepends-dummy (0.invalid.0) ...

dpkg: pbuilder-satisfydepends-dummy: dependency problems, but configuring anyway as you requested:

pbuilder-satisfydepends-dummy depends on debhelper (&gt;= 8); however:

Package debhelper is not installed.

pbuilder-satisfydepends-dummy depends on python-all; however:

Package python-all is not installed.

pbuilder-satisfydepends-dummy depends on python-setuptools; however:

Package python-setuptools is not installed.

pbuilder-satisfydepends-dummy depends on python3-all; however:

Package python3-all is not installed.

pbuilder-satisfydepends-dummy depends on python3-setuptools; however:

Package python3-setuptools is not installed.

pbuilder-satisfydepends-dummy depends on python-epydoc; however:

Package python-epydoc is not installed.

pbuilder-satisfydepends-dummy depends on graphviz; however:

Package graphviz is not installed.

pbuilder-satisfydepends-dummy depends on python-unittest2; however:

Package python-unittest2 is not installed.

pbuilder-satisfydepends-dummy depends on python-egenix-mxdatetime; however:

Package python-egenix-mxdatetime is not installed.

pbuilder-satisfydepends-dummy depends on python-tz; however:

Package python-tz is not installed.

pbuilder-satisfydepends-dummy depends on python3-tz | python3 (&lt;&lt; 3.3); however:

Package python3-tz is not installed.

Package python3 is not installed.

pbuilder-satisfydepends-dummy depends on python-six (&gt;= 1.4.0); however:

Package python-six is not installed.

pbuilder-satisfydepends-dummy depends on python3-six (&gt;= 1.4.0) | python3 (&lt;&lt; 3.3); however:

Package python3-six is not installed.

Package python3 is not installed.

Setting up pbuilder-satisfydepends-dummy (0.invalid.0) ...

Reading package lists...

Building dependency tree...

Reading state information...

Initializing package states...

Writing extended state information...

Building tag database...

pbuilder-satisfydepends-dummy is already installed at the requested version (0.invalid.0)

pbuilder-satisfydepends-dummy is already installed at the requested version (0.invalid.0)

The following NEW packages will be installed:

autoconf{a} automake{a} autopoint{a} autotools-dev{a} bsdmainutils{a} debhelper{a} dh-autoreconf{a} dh-python{a} dh-strip-nondeterminism{a} file{a} fontconfig{a} fontconfig-config{a} fonts-dejavu-core{a} gettext{a} gettext-base{a} graphviz{a} groff-base{a} intltool-debian{a} libann0{a} libarchive-zip-perl{a} libbsd0{a} libcairo2{a} libcdt5{a} libcgraph6{a} libcroco3{a} libdatrie1{a} libexpat1{a} libfile-stripnondeterminism-perl{a} libfontconfig1{a} libfreetype6{a} libgd3{a} libglib2.0-0{a} libgraphite2-3{a} libgts-0.7-5{a} libgvc6{a} libgvpr2{a} libharfbuzz0b{a} libice6{a} libjbig0{a} libjpeg62-turbo{a} libltdl7{a} libmagic-mgc{a} libmagic1{a} libmpdec2{a} libpango-1.0-0{a} libpangocairo-1.0-0{a} libpangoft2-1.0-0{a} libpathplan4{a} libpipeline1{a} libpixman-1-0{a} libpng16-16{a} libpython-stdlib{a} libpython2.7-minimal{a} libpython2.7-stdlib{a} libpython3-stdlib{a} libpython3.5-minimal{a} libpython3.5-stdlib{a} libsigsegv2{a} libsm6{a} libthai-data{a} libthai0{a} libtiff5{a} libtool{a} libunistring0{a} libwebp6{a} libx11-6{a} libx11-data{a} libxau6{a} libxaw7{a} libxcb-render0{a} libxcb-shm0{a} libxcb1{a} libxdmcp6{a} libxdot4{a} libxext6{a} libxml2{a} libxmu6{a} libxpm4{a} libxrender1{a} libxt6{a} m4{a} man-db{a} mime-support{a} po-debconf{a} python{a} python-all{a} python-egenix-mxdatetime{a} python-egenix-mxtools{a} python-epydoc{a} python-linecache2{a} python-minimal{a} python-pkg-resources{a} python-setuptools{a} python-six{a} python-traceback2{a} python-tz{a} python-unittest2{a} python2.7{a} python2.7-minimal{a} python3{a} python3-all{a} python3-minimal{a} python3-pkg-resources{a} python3-setuptools{a} python3-six{a} python3-tz{a} python3.5{a} python3.5-minimal{a} ucf{a} x11-common{a}

The following packages are RECOMMENDED but will NOT be installed:

fonts-liberation libglib2.0-data libgts-bin libltdl-dev libmail-sendmail-perl python-docutils python-tk shared-mime-info xdg-user-dirs xml-core

0 packages upgraded, 110 newly installed, 0 to remove and 0 not upgraded.

Need to get 0 B/33.8 MB of archives. After unpacking 118 MB will be used.

Writing extended state information...

Extracting templates from packages: 27%
Extracting templates from packages: 54%
Extracting templates from packages: 81%
Extracting templates from packages: 100%

Preconfiguring packages ...

E: Can not write log (Is /dev/pts mounted?) - posix_openpt (2: No such file or directory)

Selecting previously unselected package groff-base.

(Reading database ... 13671 files and directories currently installed.)

Preparing to unpack .../00-groff-base_1.22.3-8_amd64.deb ...

Unpacking groff-base (1.22.3-8) ...

Selecting previously unselected package libbsd0:amd64.

Preparing to unpack .../01-libbsd0_0.8.3-1_amd64.deb ...

Unpacking libbsd0:amd64 (0.8.3-1) ...

Selecting previously unselected package bsdmainutils.

Preparing to unpack .../02-bsdmainutils_9.0.12_amd64.deb ...

Unpacking bsdmainutils (9.0.12) ...

Selecting previously unselected package libpipeline1:amd64.

Preparing to unpack .../03-libpipeline1_1.4.1-2_amd64.deb ...

Unpacking libpipeline1:amd64 (1.4.1-2) ...

Selecting previously unselected package man-db.

Preparing to unpack .../04-man-db_2.7.5-1_amd64.deb ...

Unpacking man-db (2.7.5-1) ...

Selecting previously unselected package libpython2.7-minimal:amd64.

Preparing to unpack .../05-libpython2.7-minimal_2.7.12-5_amd64.deb ...

Unpacking libpython2.7-minimal:amd64 (2.7.12-5) ...

Selecting previously unselected package python2.7-minimal.

Preparing to unpack .../06-python2.7-minimal_2.7.12-5_amd64.deb ...

Unpacking python2.7-minimal (2.7.12-5) ...

Selecting previously unselected package python-minimal.

Preparing to unpack .../07-python-minimal_2.7.11-2_amd64.deb ...

Unpacking python-minimal (2.7.11-2) ...

Selecting previously unselected package mime-support.

Preparing to unpack .../08-mime-support_3.60_all.deb ...

Unpacking mime-support (3.60) ...

Selecting previously unselected package libexpat1:amd64.

Preparing to unpack .../09-libexpat1_2.2.0-1_amd64.deb ...

Unpacking libexpat1:amd64 (2.2.0-1) ...

Selecting previously unselected package libpython2.7-stdlib:amd64.

Preparing to unpack .../10-libpython2.7-stdlib_2.7.12-5_amd64.deb ...

Unpacking libpython2.7-stdlib:amd64 (2.7.12-5) ...

Selecting previously unselected package python2.7.

Preparing to unpack .../11-python2.7_2.7.12-5_amd64.deb ...

Unpacking python2.7 (2.7.12-5) ...

Selecting previously unselected package libpython-stdlib:amd64.

Preparing to unpack .../12-libpython-stdlib_2.7.11-2_amd64.deb ...

Unpacking libpython-stdlib:amd64 (2.7.11-2) ...

Setting up libpython2.7-minimal:amd64 (2.7.12-5) ...

Setting up python2.7-minimal (2.7.12-5) ...

Setting up python-minimal (2.7.11-2) ...

Selecting previously unselected package python.

(Reading database ... 15005 files and directories currently installed.)

Preparing to unpack .../00-python_2.7.11-2_amd64.deb ...

Unpacking python (2.7.11-2) ...

Selecting previously unselected package libpng16-16:amd64.

Preparing to unpack .../01-libpng16-16_1.6.26-2_amd64.deb ...

Unpacking libpng16-16:amd64 (1.6.26-2) ...

Selecting previously unselected package libfreetype6:amd64.

Preparing to unpack .../02-libfreetype6_2.6.3-3+b1_amd64.deb ...

Unpacking libfreetype6:amd64 (2.6.3-3+b1) ...

Selecting previously unselected package ucf.

Preparing to unpack .../03-ucf_3.0036_all.deb ...

Moving old data out of the way

Unpacking ucf (3.0036) ...

Selecting previously unselected package fonts-dejavu-core.

Preparing to unpack .../04-fonts-dejavu-core_2.37-1_all.deb ...

Unpacking fonts-dejavu-core (2.37-1) ...

Selecting previously unselected package fontconfig-config.

Preparing to unpack .../05-fontconfig-config_2.11.0-6.7_all.deb ...

Unpacking fontconfig-config (2.11.0-6.7) ...

Selecting previously unselected package libfontconfig1:amd64.

Preparing to unpack .../06-libfontconfig1_2.11.0-6.7_amd64.deb ...

Unpacking libfontconfig1:amd64 (2.11.0-6.7) ...

Selecting previously unselected package fontconfig.

Preparing to unpack .../07-fontconfig_2.11.0-6.7_amd64.deb ...

Unpacking fontconfig (2.11.0-6.7) ...

Selecting previously unselected package libglib2.0-0:amd64.

Preparing to unpack .../08-libglib2.0-0_2.50.2-1_amd64.deb ...

Unpacking libglib2.0-0:amd64 (2.50.2-1) ...

Selecting previously unselected package libgts-0.7-5:amd64.

Preparing to unpack .../09-libgts-0.7-5_0.7.6+darcs121130-1.2_amd64.deb ...

Unpacking libgts-0.7-5:amd64 (0.7.6+darcs121130-1.2) ...

Selecting previously unselected package x11-common.

Preparing to unpack .../10-x11-common_1%3a7.7+16_all.deb ...

Unpacking x11-common (1:7.7+16) ...

Selecting previously unselected package libice6:amd64.

Preparing to unpack .../11-libice6_2%3a1.0.9-1+b1_amd64.deb ...

Unpacking libice6:amd64 (2:1.0.9-1+b1) ...

Selecting previously unselected package libsm6:amd64.

Preparing to unpack .../12-libsm6_2%3a1.2.2-1+b1_amd64.deb ...

Unpacking libsm6:amd64 (2:1.2.2-1+b1) ...

Selecting previously unselected package libxau6:amd64.

Preparing to unpack .../13-libxau6_1%3a1.0.8-1_amd64.deb ...

Unpacking libxau6:amd64 (1:1.0.8-1) ...

Selecting previously unselected package libxdmcp6:amd64.

Preparing to unpack .../14-libxdmcp6_1%3a1.1.2-1.1_amd64.deb ...

Unpacking libxdmcp6:amd64 (1:1.1.2-1.1) ...

Selecting previously unselected package libxcb1:amd64.

Preparing to unpack .../15-libxcb1_1.12-1_amd64.deb ...

Unpacking libxcb1:amd64 (1.12-1) ...

Selecting previously unselected package libx11-data.

Preparing to unpack .../16-libx11-data_2%3a1.6.3-1_all.deb ...

Unpacking libx11-data (2:1.6.3-1) ...

Selecting previously unselected package libx11-6:amd64.

Preparing to unpack .../17-libx11-6_2%3a1.6.3-1_amd64.deb ...

Unpacking libx11-6:amd64 (2:1.6.3-1) ...

Selecting previously unselected package libxext6:amd64.

Preparing to unpack .../18-libxext6_2%3a1.3.3-1_amd64.deb ...

Unpacking libxext6:amd64 (2:1.3.3-1) ...

Selecting previously unselected package libxpm4:amd64.

Preparing to unpack .../19-libxpm4_1%3a3.5.11-1+b1_amd64.deb ...

Unpacking libxpm4:amd64 (1:3.5.11-1+b1) ...

Selecting previously unselected package libpython3.5-minimal:amd64.

Preparing to unpack .../20-libpython3.5-minimal_3.5.2-7_amd64.deb ...

Unpacking libpython3.5-minimal:amd64 (3.5.2-7) ...

Selecting previously unselected package python3.5-minimal.

Preparing to unpack .../21-python3.5-minimal_3.5.2-7_amd64.deb ...

Unpacking python3.5-minimal (3.5.2-7) ...

Selecting previously unselected package python3-minimal.

Preparing to unpack .../22-python3-minimal_3.5.1-4_amd64.deb ...

Unpacking python3-minimal (3.5.1-4) ...

Selecting previously unselected package libmpdec2:amd64.

Preparing to unpack .../23-libmpdec2_2.4.2-1_amd64.deb ...

Unpacking libmpdec2:amd64 (2.4.2-1) ...

Selecting previously unselected package libpython3.5-stdlib:amd64.

Preparing to unpack .../24-libpython3.5-stdlib_3.5.2-7_amd64.deb ...

Unpacking libpython3.5-stdlib:amd64 (3.5.2-7) ...

Selecting previously unselected package python3.5.

Preparing to unpack .../25-python3.5_3.5.2-7_amd64.deb ...

Unpacking python3.5 (3.5.2-7) ...

Selecting previously unselected package libpython3-stdlib:amd64.

Preparing to unpack .../26-libpython3-stdlib_3.5.1-4_amd64.deb ...

Unpacking libpython3-stdlib:amd64 (3.5.1-4) ...

Selecting previously unselected package dh-python.

Preparing to unpack .../27-dh-python_2.20160818_all.deb ...

Unpacking dh-python (2.20160818) ...

Setting up libpython3.5-minimal:amd64 (3.5.2-7) ...

Setting up libexpat1:amd64 (2.2.0-1) ...

Setting up python3.5-minimal (3.5.2-7) ...

Setting up python3-minimal (3.5.1-4) ...

Selecting previously unselected package python3.

(Reading database ... 16545 files and directories currently installed.)

Preparing to unpack .../00-python3_3.5.1-4_amd64.deb ...

Unpacking python3 (3.5.1-4) ...

Selecting previously unselected package libjbig0:amd64.

Preparing to unpack .../01-libjbig0_2.1-3.1_amd64.deb ...

Unpacking libjbig0:amd64 (2.1-3.1) ...

Selecting previously unselected package libmagic-mgc.

Preparing to unpack .../02-libmagic-mgc_1%3a5.29-1_amd64.deb ...

Unpacking libmagic-mgc (1:5.29-1) ...

Selecting previously unselected package libmagic1:amd64.

Preparing to unpack .../03-libmagic1_1%3a5.29-1_amd64.deb ...

Unpacking libmagic1:amd64 (1:5.29-1) ...

Selecting previously unselected package file.

Preparing to unpack .../04-file_1%3a5.29-1_amd64.deb ...

Unpacking file (1:5.29-1) ...

Selecting previously unselected package gettext-base.

Preparing to unpack .../05-gettext-base_0.19.8.1-1_amd64.deb ...

Unpacking gettext-base (0.19.8.1-1) ...

Selecting previously unselected package libxml2:amd64.

Preparing to unpack .../06-libxml2_2.9.4+dfsg1-2.1_amd64.deb ...

Unpacking libxml2:amd64 (2.9.4+dfsg1-2.1) ...

Selecting previously unselected package libsigsegv2:amd64.

Preparing to unpack .../07-libsigsegv2_2.10-5_amd64.deb ...

Unpacking libsigsegv2:amd64 (2.10-5) ...

Selecting previously unselected package m4.

Preparing to unpack .../08-m4_1.4.17-5_amd64.deb ...

Unpacking m4 (1.4.17-5) ...

Selecting previously unselected package autoconf.

Preparing to unpack .../09-autoconf_2.69-10_all.deb ...

Unpacking autoconf (2.69-10) ...

Selecting previously unselected package autotools-dev.

Preparing to unpack .../10-autotools-dev_20161112.1_all.deb ...

Unpacking autotools-dev (20161112.1) ...

Selecting previously unselected package automake.

Preparing to unpack .../11-automake_1%3a1.15-5_all.deb ...

Unpacking automake (1:1.15-5) ...

Selecting previously unselected package autopoint.

Preparing to unpack .../12-autopoint_0.19.8.1-1_all.deb ...

Unpacking autopoint (0.19.8.1-1) ...

Selecting previously unselected package libtool.

Preparing to unpack .../13-libtool_2.4.6-2_all.deb ...

Unpacking libtool (2.4.6-2) ...

Selecting previously unselected package dh-autoreconf.

Preparing to unpack .../14-dh-autoreconf_12_all.deb ...

Unpacking dh-autoreconf (12) ...

Selecting previously unselected package libarchive-zip-perl.

Preparing to unpack .../15-libarchive-zip-perl_1.59-1_all.deb ...

Unpacking libarchive-zip-perl (1.59-1) ...

Selecting previously unselected package libfile-stripnondeterminism-perl.

Preparing to unpack .../16-libfile-stripnondeterminism-perl_0.028-1_all.deb ...

Unpacking libfile-stripnondeterminism-perl (0.028-1) ...

Selecting previously unselected package dh-strip-nondeterminism.

Preparing to unpack .../17-dh-strip-nondeterminism_0.028-1_all.deb ...

Unpacking dh-strip-nondeterminism (0.028-1) ...

Selecting previously unselected package libcroco3:amd64.

Preparing to unpack .../18-libcroco3_0.6.11-2_amd64.deb ...

Unpacking libcroco3:amd64 (0.6.11-2) ...

Selecting previously unselected package libunistring0:amd64.

Preparing to unpack .../19-libunistring0_0.9.6+really0.9.3-0.1_amd64.deb ...

Unpacking libunistring0:amd64 (0.9.6+really0.9.3-0.1) ...

Selecting previously unselected package gettext.

Preparing to unpack .../20-gettext_0.19.8.1-1_amd64.deb ...

Unpacking gettext (0.19.8.1-1) ...

Selecting previously unselected package intltool-debian.

Preparing to unpack .../21-intltool-debian_0.35.0+20060710.4_all.deb ...

Unpacking intltool-debian (0.35.0+20060710.4) ...

Selecting previously unselected package po-debconf.

Preparing to unpack .../22-po-debconf_1.0.20_all.deb ...

Unpacking po-debconf (1.0.20) ...

Selecting previously unselected package debhelper.

Preparing to unpack .../23-debhelper_10.2.2_all.deb ...

Unpacking debhelper (10.2.2) ...

Selecting previously unselected package libann0.

Preparing to unpack .../24-libann0_1.1.2+doc-5+b3_amd64.deb ...

Unpacking libann0 (1.1.2+doc-5+b3) ...

Selecting previously unselected package libcdt5.

Preparing to unpack .../25-libcdt5_2.38.0-16_amd64.deb ...

Unpacking libcdt5 (2.38.0-16) ...

Selecting previously unselected package libcgraph6.

Preparing to unpack .../26-libcgraph6_2.38.0-16_amd64.deb ...

Unpacking libcgraph6 (2.38.0-16) ...

Selecting previously unselected package libjpeg62-turbo:amd64.

Preparing to unpack .../27-libjpeg62-turbo_1%3a1.5.1-2_amd64.deb ...

Unpacking libjpeg62-turbo:amd64 (1:1.5.1-2) ...

Selecting previously unselected package libtiff5:amd64.

Preparing to unpack .../28-libtiff5_4.0.6-3_amd64.deb ...

Unpacking libtiff5:amd64 (4.0.6-3) ...

Selecting previously unselected package libwebp6:amd64.

Preparing to unpack .../29-libwebp6_0.5.1-3_amd64.deb ...

Unpacking libwebp6:amd64 (0.5.1-3) ...

Selecting previously unselected package libgd3:amd64.

Preparing to unpack .../30-libgd3_2.2.3-87-gd0fec80-3_amd64.deb ...

Unpacking libgd3:amd64 (2.2.3-87-gd0fec80-3) ...

Selecting previously unselected package libpixman-1-0:amd64.

Preparing to unpack .../31-libpixman-1-0_0.34.0-1_amd64.deb ...

Unpacking libpixman-1-0:amd64 (0.34.0-1) ...

Selecting previously unselected package libxcb-render0:amd64.

Preparing to unpack .../32-libxcb-render0_1.12-1_amd64.deb ...

Unpacking libxcb-render0:amd64 (1.12-1) ...

Selecting previously unselected package libxcb-shm0:amd64.

Preparing to unpack .../33-libxcb-shm0_1.12-1_amd64.deb ...

Unpacking libxcb-shm0:amd64 (1.12-1) ...

Selecting previously unselected package libxrender1:amd64.

Preparing to unpack .../34-libxrender1_1%3a0.9.9-2_amd64.deb ...

Unpacking libxrender1:amd64 (1:0.9.9-2) ...

Selecting previously unselected package libcairo2:amd64.

Preparing to unpack .../35-libcairo2_1.14.6-1.1_amd64.deb ...

Unpacking libcairo2:amd64 (1.14.6-1.1) ...

Selecting previously unselected package libltdl7:amd64.

Preparing to unpack .../36-libltdl7_2.4.6-2_amd64.deb ...

Unpacking libltdl7:amd64 (2.4.6-2) ...

Selecting previously unselected package libthai-data.

Preparing to unpack .../37-libthai-data_0.1.25-2_all.deb ...

Unpacking libthai-data (0.1.25-2) ...

Selecting previously unselected package libdatrie1:amd64.

Preparing to unpack .../38-libdatrie1_0.2.10-4_amd64.deb ...

Unpacking libdatrie1:amd64 (0.2.10-4) ...

Selecting previously unselected package libthai0:amd64.

Preparing to unpack .../39-libthai0_0.1.25-2_amd64.deb ...

Unpacking libthai0:amd64 (0.1.25-2) ...

Selecting previously unselected package libpango-1.0-0:amd64.

Preparing to unpack .../40-libpango-1.0-0_1.40.3-3_amd64.deb ...

Unpacking libpango-1.0-0:amd64 (1.40.3-3) ...

Selecting previously unselected package libgraphite2-3:amd64.

Preparing to unpack .../41-libgraphite2-3_1.3.9-2_amd64.deb ...

Unpacking libgraphite2-3:amd64 (1.3.9-2) ...

Selecting previously unselected package libharfbuzz0b:amd64.

Preparing to unpack .../42-libharfbuzz0b_1.2.7-1+b1_amd64.deb ...

Unpacking libharfbuzz0b:amd64 (1.2.7-1+b1) ...

Selecting previously unselected package libpangoft2-1.0-0:amd64.

Preparing to unpack .../43-libpangoft2-1.0-0_1.40.3-3_amd64.deb ...

Unpacking libpangoft2-1.0-0:amd64 (1.40.3-3) ...

Selecting previously unselected package libpangocairo-1.0-0:amd64.

Preparing to unpack .../44-libpangocairo-1.0-0_1.40.3-3_amd64.deb ...

Unpacking libpangocairo-1.0-0:amd64 (1.40.3-3) ...

Selecting previously unselected package libpathplan4.

Preparing to unpack .../45-libpathplan4_2.38.0-16_amd64.deb ...

Unpacking libpathplan4 (2.38.0-16) ...

Selecting previously unselected package libxdot4.

Preparing to unpack .../46-libxdot4_2.38.0-16_amd64.deb ...

Unpacking libxdot4 (2.38.0-16) ...

Selecting previously unselected package libgvc6.

Preparing to unpack .../47-libgvc6_2.38.0-16_amd64.deb ...

Unpacking libgvc6 (2.38.0-16) ...

Selecting previously unselected package libgvpr2.

Preparing to unpack .../48-libgvpr2_2.38.0-16_amd64.deb ...

Unpacking libgvpr2 (2.38.0-16) ...

Selecting previously unselected package libxt6:amd64.

Preparing to unpack .../49-libxt6_1%3a1.1.5-1_amd64.deb ...

Unpacking libxt6:amd64 (1:1.1.5-1) ...

Selecting previously unselected package libxmu6:amd64.

Preparing to unpack .../50-libxmu6_2%3a1.1.2-2_amd64.deb ...

Unpacking libxmu6:amd64 (2:1.1.2-2) ...

Selecting previously unselected package libxaw7:amd64.

Preparing to unpack .../51-libxaw7_2%3a1.0.13-1_amd64.deb ...

Unpacking libxaw7:amd64 (2:1.0.13-1) ...

Selecting previously unselected package graphviz.

Preparing to unpack .../52-graphviz_2.38.0-16_amd64.deb ...

Unpacking graphviz (2.38.0-16) ...

Selecting previously unselected package python-all.

Preparing to unpack .../53-python-all_2.7.11-2_amd64.deb ...

Unpacking python-all (2.7.11-2) ...

Selecting previously unselected package python-egenix-mxtools.

Preparing to unpack .../54-python-egenix-mxtools_3.2.9-1_amd64.deb ...

Unpacking python-egenix-mxtools (3.2.9-1) ...

Selecting previously unselected package python-egenix-mxdatetime.

Preparing to unpack .../55-python-egenix-mxdatetime_3.2.9-1_amd64.deb ...

Unpacking python-egenix-mxdatetime (3.2.9-1) ...

Selecting previously unselected package python-epydoc.

Preparing to unpack .../56-python-epydoc_3.0.1+dfsg-14_all.deb ...

Unpacking python-epydoc (3.0.1+dfsg-14) ...

Selecting previously unselected package python-linecache2.

Preparing to unpack .../57-python-linecache2_1.0.0-3_all.deb ...

Unpacking python-linecache2 (1.0.0-3) ...

Selecting previously unselected package python-pkg-resources.

Preparing to unpack .../58-python-pkg-resources_28.7.1-1_all.deb ...

Unpacking python-pkg-resources (28.7.1-1) ...

Selecting previously unselected package python-setuptools.

Preparing to unpack .../59-python-setuptools_28.7.1-1_all.deb ...

Unpacking python-setuptools (28.7.1-1) ...

Selecting previously unselected package python-six.

Preparing to unpack .../60-python-six_1.10.0-3_all.deb ...

Unpacking python-six (1.10.0-3) ...

Selecting previously unselected package python-traceback2.

Preparing to unpack .../61-python-traceback2_1.4.0-4_all.deb ...

Unpacking python-traceback2 (1.4.0-4) ...

Selecting previously unselected package python-tz.

Preparing to unpack .../62-python-tz_2015.7+dfsg-0.1_all.deb ...

Unpacking python-tz (2015.7+dfsg-0.1) ...

Selecting previously unselected package python-unittest2.

Preparing to unpack .../63-python-unittest2_1.1.0-6.1_all.deb ...

Unpacking python-unittest2 (1.1.0-6.1) ...

Selecting previously unselected package python3-all.

Preparing to unpack .../64-python3-all_3.5.1-4_amd64.deb ...

Unpacking python3-all (3.5.1-4) ...

Selecting previously unselected package python3-pkg-resources.

Preparing to unpack .../65-python3-pkg-resources_28.7.1-1_all.deb ...

Unpacking python3-pkg-resources (28.7.1-1) ...

Selecting previously unselected package python3-setuptools.

Preparing to unpack .../66-python3-setuptools_28.7.1-1_all.deb ...

Unpacking python3-setuptools (28.7.1-1) ...

Selecting previously unselected package python3-six.

Preparing to unpack .../67-python3-six_1.10.0-3_all.deb ...

Unpacking python3-six (1.10.0-3) ...

Selecting previously unselected package python3-tz.

Preparing to unpack .../68-python3-tz_2015.7+dfsg-0.1_all.deb ...

Unpacking python3-tz (2015.7+dfsg-0.1) ...

Setting up libpathplan4 (2.38.0-16) ...

Setting up libxdot4 (2.38.0-16) ...

Setting up libjpeg62-turbo:amd64 (1:1.5.1-2) ...

Setting up libarchive-zip-perl (1.59-1) ...

Setting up mime-support (3.60) ...

Setting up libpng16-16:amd64 (1.6.26-2) ...

Setting up libjbig0:amd64 (2.1-3.1) ...

Setting up libsigsegv2:amd64 (2.10-5) ...

Setting up fonts-dejavu-core (2.37-1) ...

Setting up groff-base (1.22.3-8) ...

Setting up libglib2.0-0:amd64 (2.50.2-1) ...

No schema files found: doing nothing.

Setting up libdatrie1:amd64 (0.2.10-4) ...

Setting up libtiff5:amd64 (4.0.6-3) ...

Setting up gettext-base (0.19.8.1-1) ...

Setting up libpipeline1:amd64 (1.4.1-2) ...

Setting up m4 (1.4.17-5) ...

Setting up libbsd0:amd64 (0.8.3-1) ...

Setting up ucf (3.0036) ...

Setting up libxml2:amd64 (2.9.4+dfsg1-2.1) ...

Setting up libfreetype6:amd64 (2.6.3-3+b1) ...

Setting up libmagic-mgc (1:5.29-1) ...

Setting up libmagic1:amd64 (1:5.29-1) ...

Setting up libgraphite2-3:amd64 (1.3.9-2) ...

Setting up libcroco3:amd64 (0.6.11-2) ...

Setting up libpixman-1-0:amd64 (0.34.0-1) ...

Processing triggers for libc-bin (2.24-5) ...

Setting up autotools-dev (20161112.1) ...

Setting up libunistring0:amd64 (0.9.6+really0.9.3-0.1) ...

Setting up libltdl7:amd64 (2.4.6-2) ...

Setting up libann0 (1.1.2+doc-5+b3) ...

Setting up libthai-data (0.1.25-2) ...

Setting up libxdmcp6:amd64 (1:1.1.2-1.1) ...

Setting up bsdmainutils (9.0.12) ...

update-alternatives: using /usr/bin/bsd-write to provide /usr/bin/write (write) in auto mode

update-alternatives: using /usr/bin/bsd-from to provide /usr/bin/from (from) in auto mode

Setting up x11-common (1:7.7+16) ...

update-rc.d: warning: start and stop actions are no longer supported; falling back to defaults

invoke-rc.d: could not determine current runlevel

Setting up X socket directories... /tmp/.X11-unix /tmp/.ICE-unix.

Setting up libcdt5 (2.38.0-16) ...

Setting up libx11-data (2:1.6.3-1) ...

Setting up libpython2.7-stdlib:amd64 (2.7.12-5) ...

Setting up libxau6:amd64 (1:1.0.8-1) ...

Setting up autopoint (0.19.8.1-1) ...

Setting up libmpdec2:amd64 (2.4.2-1) ...

Setting up libcgraph6 (2.38.0-16) ...

Setting up libwebp6:amd64 (0.5.1-3) ...

Setting up libfile-stripnondeterminism-perl (0.028-1) ...

Setting up libgts-0.7-5:amd64 (0.7.6+darcs121130-1.2) ...

Setting up fontconfig-config (2.11.0-6.7) ...

Setting up gettext (0.19.8.1-1) ...

Setting up libgvpr2 (2.38.0-16) ...

Setting up libpython3.5-stdlib:amd64 (3.5.2-7) ...

Setting up python2.7 (2.7.12-5) ...

Setting up libharfbuzz0b:amd64 (1.2.7-1+b1) ...

Setting up autoconf (2.69-10) ...

Setting up libthai0:amd64 (0.1.25-2) ...

Setting up file (1:5.29-1) ...

Setting up libpython-stdlib:amd64 (2.7.11-2) ...

Setting up intltool-debian (0.35.0+20060710.4) ...

Setting up automake (1:1.15-5) ...

update-alternatives: using /usr/bin/automake-1.15 to provide /usr/bin/automake (automake) in auto mode

Setting up libice6:amd64 (2:1.0.9-1+b1) ...

Setting up man-db (2.7.5-1) ...

Not building database; man-db/auto-update is not &#39;true&#39;.

Setting up libxcb1:amd64 (1.12-1) ...

Setting up python (2.7.11-2) ...

Setting up python-linecache2 (1.0.0-3) ...

Setting up libtool (2.4.6-2) ...

Setting up python3.5 (3.5.2-7) ...

Setting up libpython3-stdlib:amd64 (3.5.1-4) ...

Setting up libfontconfig1:amd64 (2.11.0-6.7) ...

Setting up libsm6:amd64 (2:1.2.2-1+b1) ...

Setting up libxcb-render0:amd64 (1.12-1) ...

Setting up python-egenix-mxtools (3.2.9-1) ...

Setting up po-debconf (1.0.20) ...

Setting up python-tz (2015.7+dfsg-0.1) ...

Setting up libx11-6:amd64 (2:1.6.3-1) ...

Setting up python-pkg-resources (28.7.1-1) ...

Setting up python-epydoc (3.0.1+dfsg-14) ...

Setting up python-six (1.10.0-3) ...

Setting up libxcb-shm0:amd64 (1.12-1) ...

Setting up libxpm4:amd64 (1:3.5.11-1+b1) ...

Setting up libxt6:amd64 (1:1.1.5-1) ...

Setting up libxrender1:amd64 (1:0.9.9-2) ...

Setting up python-egenix-mxdatetime (3.2.9-1) ...

Setting up python-traceback2 (1.4.0-4) ...

Setting up python-all (2.7.11-2) ...

Setting up fontconfig (2.11.0-6.7) ...

Regenerating fonts cache... done.

Setting up python-setuptools (28.7.1-1) ...

Setting up libxext6:amd64 (2:1.3.3-1) ...

Setting up libgd3:amd64 (2.2.3-87-gd0fec80-3) ...

Setting up libxmu6:amd64 (2:1.1.2-2) ...

Setting up python-unittest2 (1.1.0-6.1) ...

update-alternatives: using /usr/bin/python2-unit2 to provide /usr/bin/unit2 (unit2) in auto mode

Setting up libpango-1.0-0:amd64 (1.40.3-3) ...

Setting up libxaw7:amd64 (2:1.0.13-1) ...

Setting up libcairo2:amd64 (1.14.6-1.1) ...

Setting up libpangoft2-1.0-0:amd64 (1.40.3-3) ...

Setting up libpangocairo-1.0-0:amd64 (1.40.3-3) ...

Setting up libgvc6 (2.38.0-16) ...

Setting up graphviz (2.38.0-16) ...

Setting up python3 (3.5.1-4) ...

Setting up python3-six (1.10.0-3) ...

Setting up python3-pkg-resources (28.7.1-1) ...

Setting up python3-all (3.5.1-4) ...

Setting up python3-setuptools (28.7.1-1) ...

Setting up dh-python (2.20160818) ...

Setting up python3-tz (2015.7+dfsg-0.1) ...

Setting up debhelper (10.2.2) ...

Setting up dh-autoreconf (12) ...

Setting up dh-strip-nondeterminism (0.028-1) ...

Processing triggers for libc-bin (2.24-5) ...

Reading package lists...

Building dependency tree...

Reading state information...

Reading extended state information...

Initializing package states...

Writing extended state information...

Building tag database...

-&gt; Finished parsing the build-deps

Reading package lists...

Building dependency tree...

Reading state information...

apt-utils is already the newest version (1.3.1).

The following NEW packages will be installed:

fakeroot libfakeroot

0 upgraded, 2 newly installed, 0 to remove and 0 not upgraded.

Need to get 0 B/131 kB of archives.

After this operation, 370 kB of additional disk space will be used.

E: Can not write log (Is /dev/pts mounted?) - posix_openpt (2: No such file or directory)

Selecting previously unselected package libfakeroot:amd64.

(Reading database ... 18607 files and directories currently installed.)

Preparing to unpack .../0-libfakeroot_1.21-2_amd64.deb ...

Unpacking libfakeroot:amd64 (1.21-2) ...

Selecting previously unselected package fakeroot.

Preparing to unpack .../1-fakeroot_1.21-2_amd64.deb ...

Unpacking fakeroot (1.21-2) ...

Processing triggers for libc-bin (2.24-5) ...

Setting up libfakeroot:amd64 (1.21-2) ...

Processing triggers for man-db (2.7.5-1) ...

Not building database; man-db/auto-update is not &#39;true&#39;.

Setting up fakeroot (1.21-2) ...

update-alternatives: using /usr/bin/fakeroot-sysv to provide /usr/bin/fakeroot (fakeroot) in auto mode

Processing triggers for libc-bin (2.24-5) ...

[0mI: Copying back the cached apt archive contents [0m

[0mI: Copying source file [0m

[0mI: copying [/tmp/tmpexA2rv/logilab-common_1.3.0-1~revf3ab15166db9.dsc] [0m

[0mI: copying [/tmp/tmpexA2rv/logilab-common_1.3.0.orig.tar.gz] [0m

[0mI: copying [/tmp/tmpexA2rv/logilab-common_1.3.0-1~revf3ab15166db9.diff.gz] [0m

[0mI: Extracting source [0m

dpkg-source: warning: extracting unsigned source package (logilab-common_1.3.0-1~revf3ab15166db9.dsc)

dpkg-source: info: extracting logilab-common in logilab-common-1.3.0

dpkg-source: info: unpacking logilab-common_1.3.0.orig.tar.gz

dpkg-source: info: applying logilab-common_1.3.0-1~revf3ab15166db9.diff.gz

[0mI: Building the package [0m

[0mI: Running cd /build/*/ &amp;&amp; env PATH=&quot;/usr/sbin:/usr/bin:/sbin:/bin&quot; HOME=&quot;/nonexistent&quot; dpkg-buildpackage -us -uc -rfakeroot [0m

dpkg-buildpackage: info: source package logilab-common

dpkg-buildpackage: info: source version 1.3.0-1~revf3ab15166db9

dpkg-buildpackage: info: source distribution sid

dpkg-buildpackage: info: source changed by Denis Laxalde &lt;denis.laxalde@logilab.fr&gt;

dpkg-source --before-build logilab-common-1.3.0

dpkg-buildpackage: info: host architecture amd64

fakeroot debian/rules clean

dh clean --with python2,python3

dh: Compatibility levels before 9 are deprecated (level 8 in use)

dh_testdir

dh_auto_clean

dh_auto_clean: Compatibility levels before 9 are deprecated (level 8 in use)

python setup.py clean -a

running clean

&#39;build/lib.linux-x86_64-2.7&#39; does not exist -- can&#39;t clean it

&#39;build/bdist.linux-x86_64&#39; does not exist -- can&#39;t clean it

&#39;build/scripts-2.7&#39; does not exist -- can&#39;t clean it

find . -name \*.pyc -exec rm {} \+

debian/rules override_dh_clean

make[1]: Entering directory &#39;/build/logilab-common-1.3.0&#39;

dh_clean

dh_clean: Compatibility levels before 9 are deprecated (level 8 in use)

rm -rf doc/apidoc

rm -rf logilab_common.egg-info

make[1]: Leaving directory &#39;/build/logilab-common-1.3.0&#39;

dpkg-source -b logilab-common-1.3.0

dpkg-source: info: using source format &#39;1.0&#39;

dpkg-source: info: building logilab-common using existing logilab-common_1.3.0.orig.tar.gz

dpkg-source: info: building logilab-common in logilab-common_1.3.0-1~revf3ab15166db9.diff.gz

dpkg-source: warning: ignoring deletion of directory logilab_common.egg-info

dpkg-source: warning: ignoring deletion of file logilab_common.egg-info/top_level.txt, use --include-removal to override

dpkg-source: warning: ignoring deletion of file logilab_common.egg-info/SOURCES.txt, use --include-removal to override

dpkg-source: warning: ignoring deletion of file logilab_common.egg-info/dependency_links.txt, use --include-removal to override

dpkg-source: warning: ignoring deletion of file logilab_common.egg-info/PKG-INFO, use --include-removal to override

dpkg-source: warning: ignoring deletion of file logilab_common.egg-info/requires.txt, use --include-removal to override

dpkg-source: warning: ignoring deletion of file logilab_common.egg-info/namespace_packages.txt, use --include-removal to override

dpkg-source: info: building logilab-common in logilab-common_1.3.0-1~revf3ab15166db9.dsc

debian/rules build

dh build-indep --with python2,python3

dh: Compatibility levels before 9 are deprecated (level 8 in use)

dh_testdir -i

dh_update_autotools_config -i

dh_auto_configure -i

dh_auto_configure: Compatibility levels before 9 are deprecated (level 8 in use)

debian/rules override_dh_auto_build

make[1]: Entering directory &#39;/build/logilab-common-1.3.0&#39;

dh_auto_build

dh_auto_build: Compatibility levels before 9 are deprecated (level 8 in use)

python setup.py build --force

running build

running build_py

creating build

creating build/lib.linux-x86_64-2.7

creating build/lib.linux-x86_64-2.7/logilab

copying logilab/__init__.py -&gt; build/lib.linux-x86_64-2.7/logilab

creating build/lib.linux-x86_64-2.7/logilab/common

copying logilab/common/sphinxutils.py -&gt; build/lib.linux-x86_64-2.7/logilab/common

copying logilab/common/tasksqueue.py -&gt; build/lib.linux-x86_64-2.7/logilab/common

copying logilab/common/changelog.py -&gt; build/lib.linux-x86_64-2.7/logilab/common

copying logilab/common/debugger.py -&gt; build/lib.linux-x86_64-2.7/logilab/common

copying logilab/common/cache.py -&gt; build/lib.linux-x86_64-2.7/logilab/common

copying logilab/common/fileutils.py -&gt; build/lib.linux-x86_64-2.7/logilab/common

copying logilab/common/modutils.py -&gt; build/lib.linux-x86_64-2.7/logilab/common

copying logilab/common/pytest.py -&gt; build/lib.linux-x86_64-2.7/logilab/common

copying logilab/common/visitor.py -&gt; build/lib.linux-x86_64-2.7/logilab/common

copying logilab/common/graph.py -&gt; build/lib.linux-x86_64-2.7/logilab/common

copying logilab/common/vcgutils.py -&gt; build/lib.linux-x86_64-2.7/logilab/common

copying logilab/common/tree.py -&gt; build/lib.linux-x86_64-2.7/logilab/common

copying logilab/common/textutils.py -&gt; build/lib.linux-x86_64-2.7/logilab/common

copying logilab/common/compat.py -&gt; build/lib.linux-x86_64-2.7/logilab/common

copying logilab/common/registry.py -&gt; build/lib.linux-x86_64-2.7/logilab/common

copying logilab/common/date.py -&gt; build/lib.linux-x86_64-2.7/logilab/common

copying logilab/common/xmlutils.py -&gt; build/lib.linux-x86_64-2.7/logilab/common

copying logilab/common/sphinx_ext.py -&gt; build/lib.linux-x86_64-2.7/logilab/common

copying logilab/common/urllib2ext.py -&gt; build/lib.linux-x86_64-2.7/logilab/common

copying logilab/common/table.py -&gt; build/lib.linux-x86_64-2.7/logilab/common

copying logilab/common/testlib.py -&gt; build/lib.linux-x86_64-2.7/logilab/common

copying logilab/common/proc.py -&gt; build/lib.linux-x86_64-2.7/logilab/common

copying logilab/common/clcommands.py -&gt; build/lib.linux-x86_64-2.7/logilab/common

copying logilab/common/logging_ext.py -&gt; build/lib.linux-x86_64-2.7/logilab/common

copying logilab/common/__init__.py -&gt; build/lib.linux-x86_64-2.7/logilab/common

copying logilab/common/decorators.py -&gt; build/lib.linux-x86_64-2.7/logilab/common

copying logilab/common/daemon.py -&gt; build/lib.linux-x86_64-2.7/logilab/common

copying logilab/common/shellutils.py -&gt; build/lib.linux-x86_64-2.7/logilab/common

copying logilab/common/configuration.py -&gt; build/lib.linux-x86_64-2.7/logilab/common

copying logilab/common/optparser.py -&gt; build/lib.linux-x86_64-2.7/logilab/common

copying logilab/common/deprecation.py -&gt; build/lib.linux-x86_64-2.7/logilab/common

copying logilab/common/optik_ext.py -&gt; build/lib.linux-x86_64-2.7/logilab/common

copying logilab/common/umessage.py -&gt; build/lib.linux-x86_64-2.7/logilab/common

copying logilab/common/interface.py -&gt; build/lib.linux-x86_64-2.7/logilab/common

creating build/lib.linux-x86_64-2.7/logilab/common/ureports

copying logilab/common/ureports/html_writer.py -&gt; build/lib.linux-x86_64-2.7/logilab/common/ureports

copying logilab/common/ureports/nodes.py -&gt; build/lib.linux-x86_64-2.7/logilab/common/ureports

copying logilab/common/ureports/docbook_writer.py -&gt; build/lib.linux-x86_64-2.7/logilab/common/ureports

copying logilab/common/ureports/__init__.py -&gt; build/lib.linux-x86_64-2.7/logilab/common/ureports

copying logilab/common/ureports/text_writer.py -&gt; build/lib.linux-x86_64-2.7/logilab/common/ureports

running build_scripts

creating build/scripts-2.7

copying and adjusting bin/logilab-pytest -&gt; build/scripts-2.7

changing mode of build/scripts-2.7/logilab-pytest from 644 to 755

python setup.py build --build-purelib build/lib

running build

running build_py

creating build/lib

creating build/lib/logilab

copying logilab/__init__.py -&gt; build/lib/logilab

creating build/lib/logilab/common

copying logilab/common/sphinxutils.py -&gt; build/lib/logilab/common

copying logilab/common/tasksqueue.py -&gt; build/lib/logilab/common

copying logilab/common/changelog.py -&gt; build/lib/logilab/common

copying logilab/common/debugger.py -&gt; build/lib/logilab/common

copying logilab/common/cache.py -&gt; build/lib/logilab/common

copying logilab/common/fileutils.py -&gt; build/lib/logilab/common

copying logilab/common/modutils.py -&gt; build/lib/logilab/common

copying logilab/common/pytest.py -&gt; build/lib/logilab/common

copying logilab/common/visitor.py -&gt; build/lib/logilab/common

copying logilab/common/graph.py -&gt; build/lib/logilab/common

copying logilab/common/vcgutils.py -&gt; build/lib/logilab/common

copying logilab/common/tree.py -&gt; build/lib/logilab/common

copying logilab/common/textutils.py -&gt; build/lib/logilab/common

copying logilab/common/compat.py -&gt; build/lib/logilab/common

copying logilab/common/registry.py -&gt; build/lib/logilab/common

copying logilab/common/date.py -&gt; build/lib/logilab/common

copying logilab/common/xmlutils.py -&gt; build/lib/logilab/common

copying logilab/common/sphinx_ext.py -&gt; build/lib/logilab/common

copying logilab/common/urllib2ext.py -&gt; build/lib/logilab/common

copying logilab/common/table.py -&gt; build/lib/logilab/common

copying logilab/common/testlib.py -&gt; build/lib/logilab/common

copying logilab/common/proc.py -&gt; build/lib/logilab/common

copying logilab/common/clcommands.py -&gt; build/lib/logilab/common

copying logilab/common/logging_ext.py -&gt; build/lib/logilab/common

copying logilab/common/__init__.py -&gt; build/lib/logilab/common

copying logilab/common/decorators.py -&gt; build/lib/logilab/common

copying logilab/common/daemon.py -&gt; build/lib/logilab/common

copying logilab/common/shellutils.py -&gt; build/lib/logilab/common

copying logilab/common/configuration.py -&gt; build/lib/logilab/common

copying logilab/common/optparser.py -&gt; build/lib/logilab/common

copying logilab/common/deprecation.py -&gt; build/lib/logilab/common

copying logilab/common/optik_ext.py -&gt; build/lib/logilab/common

copying logilab/common/umessage.py -&gt; build/lib/logilab/common

copying logilab/common/interface.py -&gt; build/lib/logilab/common

creating build/lib/logilab/common/ureports

copying logilab/common/ureports/html_writer.py -&gt; build/lib/logilab/common/ureports

copying logilab/common/ureports/nodes.py -&gt; build/lib/logilab/common/ureports

copying logilab/common/ureports/docbook_writer.py -&gt; build/lib/logilab/common/ureports

copying logilab/common/ureports/__init__.py -&gt; build/lib/logilab/common/ureports

copying logilab/common/ureports/text_writer.py -&gt; build/lib/logilab/common/ureports

running build_scripts

/usr/bin/make -C doc

make[2]: Entering directory &#39;/build/logilab-common-1.3.0/doc&#39;

mkdir -p apidoc

epydoc --parse-only -o apidoc --html -v --no-private --exclude=&#39;test&#39; --exclude=&quot;__pkginfo__&quot; --exclude=&quot;setup&quot; -n &quot;Logilab&#39;s common library&quot; /build/logilab-common-1.3.0/build/lib/logilab/common &gt;/dev/null

make[2]: Leaving directory &#39;/build/logilab-common-1.3.0/doc&#39;

make[1]: Leaving directory &#39;/build/logilab-common-1.3.0&#39;

debian/rules override_dh_auto_test

make[1]: Entering directory &#39;/build/logilab-common-1.3.0&#39;

python setup.py install \

--root=/build/logilab-common-1.3.0/testing/ --install-layout=deb

running install

running build

running build_py

running build_scripts

running install_lib

Skipping installation of /build/logilab-common-1.3.0/testing/usr/lib/python2.7/dist-packages/logilab/__init__.py (namespace package)

copying logilab/common/sphinxutils.py -&gt; /build/logilab-common-1.3.0/testing/usr/lib/python2.7/dist-packages/logilab/common

copying logilab/common/tasksqueue.py -&gt; /build/logilab-common-1.3.0/testing/usr/lib/python2.7/dist-packages/logilab/common

copying logilab/common/changelog.py -&gt; /build/logilab-common-1.3.0/testing/usr/lib/python2.7/dist-packages/logilab/common

copying logilab/common/debugger.py -&gt; /build/logilab-common-1.3.0/testing/usr/lib/python2.7/dist-packages/logilab/common

copying logilab/common/cache.py -&gt; /build/logilab-common-1.3.0/testing/usr/lib/python2.7/dist-packages/logilab/common

copying logilab/common/fileutils.py -&gt; /build/logilab-common-1.3.0/testing/usr/lib/python2.7/dist-packages/logilab/common

copying logilab/common/modutils.py -&gt; /build/logilab-common-1.3.0/testing/usr/lib/python2.7/dist-packages/logilab/common

copying logilab/common/pytest.py -&gt; /build/logilab-common-1.3.0/testing/usr/lib/python2.7/dist-packages/logilab/common

copying logilab/common/visitor.py -&gt; /build/logilab-common-1.3.0/testing/usr/lib/python2.7/dist-packages/logilab/common

copying logilab/common/graph.py -&gt; /build/logilab-common-1.3.0/testing/usr/lib/python2.7/dist-packages/logilab/common

copying logilab/common/vcgutils.py -&gt; /build/logilab-common-1.3.0/testing/usr/lib/python2.7/dist-packages/logilab/common

copying logilab/common/tree.py -&gt; /build/logilab-common-1.3.0/testing/usr/lib/python2.7/dist-packages/logilab/common

copying logilab/common/textutils.py -&gt; /build/logilab-common-1.3.0/testing/usr/lib/python2.7/dist-packages/logilab/common

copying logilab/common/compat.py -&gt; /build/logilab-common-1.3.0/testing/usr/lib/python2.7/dist-packages/logilab/common

copying logilab/common/registry.py -&gt; /build/logilab-common-1.3.0/testing/usr/lib/python2.7/dist-packages/logilab/common

copying logilab/common/date.py -&gt; /build/logilab-common-1.3.0/testing/usr/lib/python2.7/dist-packages/logilab/common

copying logilab/common/xmlutils.py -&gt; /build/logilab-common-1.3.0/testing/usr/lib/python2.7/dist-packages/logilab/common

copying logilab/common/sphinx_ext.py -&gt; /build/logilab-common-1.3.0/testing/usr/lib/python2.7/dist-packages/logilab/common

copying logilab/common/urllib2ext.py -&gt; /build/logilab-common-1.3.0/testing/usr/lib/python2.7/dist-packages/logilab/common

copying logilab/common/table.py -&gt; /build/logilab-common-1.3.0/testing/usr/lib/python2.7/dist-packages/logilab/common

copying logilab/common/testlib.py -&gt; /build/logilab-common-1.3.0/testing/usr/lib/python2.7/dist-packages/logilab/common

copying logilab/common/proc.py -&gt; /build/logilab-common-1.3.0/testing/usr/lib/python2.7/dist-packages/logilab/common

copying logilab/common/clcommands.py -&gt; /build/logilab-common-1.3.0/testing/usr/lib/python2.7/dist-packages/logilab/common

copying logilab/common/logging_ext.py -&gt; /build/logilab-common-1.3.0/testing/usr/lib/python2.7/dist-packages/logilab/common

copying logilab/common/__init__.py -&gt; /build/logilab-common-1.3.0/testing/usr/lib/python2.7/dist-packages/logilab/common

copying logilab/common/decorators.py -&gt; /build/logilab-common-1.3.0/testing/usr/lib/python2.7/dist-packages/logilab/common

copying logilab/common/daemon.py -&gt; /build/logilab-common-1.3.0/testing/usr/lib/python2.7/dist-packages/logilab/common

copying logilab/common/shellutils.py -&gt; /build/logilab-common-1.3.0/testing/usr/lib/python2.7/dist-packages/logilab/common

copying logilab/common/configuration.py -&gt; /build/logilab-common-1.3.0/testing/usr/lib/python2.7/dist-packages/logilab/common

copying logilab/common/optparser.py -&gt; /build/logilab-common-1.3.0/testing/usr/lib/python2.7/dist-packages/logilab/common

copying logilab/common/deprecation.py -&gt; /build/logilab-common-1.3.0/testing/usr/lib/python2.7/dist-packages/logilab/common

copying logilab/common/optik_ext.py -&gt; /build/logilab-common-1.3.0/testing/usr/lib/python2.7/dist-packages/logilab/common

copying logilab/common/umessage.py -&gt; /build/logilab-common-1.3.0/testing/usr/lib/python2.7/dist-packages/logilab/common

copying logilab/common/interface.py -&gt; /build/logilab-common-1.3.0/testing/usr/lib/python2.7/dist-packages/logilab/common

copying logilab/common/ureports/html_writer.py -&gt; /build/logilab-common-1.3.0/testing/usr/lib/python2.7/dist-packages/logilab/common/ureports

copying logilab/common/ureports/nodes.py -&gt; /build/logilab-common-1.3.0/testing/usr/lib/python2.7/dist-packages/logilab/common/ureports

copying logilab/common/ureports/docbook_writer.py -&gt; /build/logilab-common-1.3.0/testing/usr/lib/python2.7/dist-packages/logilab/common/ureports

copying logilab/common/ureports/__init__.py -&gt; /build/logilab-common-1.3.0/testing/usr/lib/python2.7/dist-packages/logilab/common/ureports

copying logilab/common/ureports/text_writer.py -&gt; /build/logilab-common-1.3.0/testing/usr/lib/python2.7/dist-packages/logilab/common/ureports

byte-compiling /build/logilab-common-1.3.0/testing/usr/lib/python2.7/dist-packages/logilab/common/sphinxutils.py to sphinxutils.pyc

byte-compiling /build/logilab-common-1.3.0/testing/usr/lib/python2.7/dist-packages/logilab/common/tasksqueue.py to tasksqueue.pyc

byte-compiling /build/logilab-common-1.3.0/testing/usr/lib/python2.7/dist-packages/logilab/common/changelog.py to changelog.pyc

byte-compiling /build/logilab-common-1.3.0/testing/usr/lib/python2.7/dist-packages/logilab/common/debugger.py to debugger.pyc

byte-compiling /build/logilab-common-1.3.0/testing/usr/lib/python2.7/dist-packages/logilab/common/cache.py to cache.pyc

byte-compiling /build/logilab-common-1.3.0/testing/usr/lib/python2.7/dist-packages/logilab/common/fileutils.py to fileutils.pyc

byte-compiling /build/logilab-common-1.3.0/testing/usr/lib/python2.7/dist-packages/logilab/common/modutils.py to modutils.pyc

byte-compiling /build/logilab-common-1.3.0/testing/usr/lib/python2.7/dist-packages/logilab/common/pytest.py to pytest.pyc

byte-compiling /build/logilab-common-1.3.0/testing/usr/lib/python2.7/dist-packages/logilab/common/visitor.py to visitor.pyc

byte-compiling /build/logilab-common-1.3.0/testing/usr/lib/python2.7/dist-packages/logilab/common/graph.py to graph.pyc

byte-compiling /build/logilab-common-1.3.0/testing/usr/lib/python2.7/dist-packages/logilab/common/vcgutils.py to vcgutils.pyc

byte-compiling /build/logilab-common-1.3.0/testing/usr/lib/python2.7/dist-packages/logilab/common/tree.py to tree.pyc

byte-compiling /build/logilab-common-1.3.0/testing/usr/lib/python2.7/dist-packages/logilab/common/textutils.py to textutils.pyc

byte-compiling /build/logilab-common-1.3.0/testing/usr/lib/python2.7/dist-packages/logilab/common/compat.py to compat.pyc

byte-compiling /build/logilab-common-1.3.0/testing/usr/lib/python2.7/dist-packages/logilab/common/registry.py to registry.pyc

byte-compiling /build/logilab-common-1.3.0/testing/usr/lib/python2.7/dist-packages/logilab/common/date.py to date.pyc

byte-compiling /build/logilab-common-1.3.0/testing/usr/lib/python2.7/dist-packages/logilab/common/xmlutils.py to xmlutils.pyc

byte-compiling /build/logilab-common-1.3.0/testing/usr/lib/python2.7/dist-packages/logilab/common/sphinx_ext.py to sphinx_ext.pyc

byte-compiling /build/logilab-common-1.3.0/testing/usr/lib/python2.7/dist-packages/logilab/common/urllib2ext.py to urllib2ext.pyc

byte-compiling /build/logilab-common-1.3.0/testing/usr/lib/python2.7/dist-packages/logilab/common/table.py to table.pyc

byte-compiling /build/logilab-common-1.3.0/testing/usr/lib/python2.7/dist-packages/logilab/common/testlib.py to testlib.pyc

byte-compiling /build/logilab-common-1.3.0/testing/usr/lib/python2.7/dist-packages/logilab/common/proc.py to proc.pyc

byte-compiling /build/logilab-common-1.3.0/testing/usr/lib/python2.7/dist-packages/logilab/common/clcommands.py to clcommands.pyc

byte-compiling /build/logilab-common-1.3.0/testing/usr/lib/python2.7/dist-packages/logilab/common/logging_ext.py to logging_ext.pyc

byte-compiling /build/logilab-common-1.3.0/testing/usr/lib/python2.7/dist-packages/logilab/common/__init__.py to __init__.pyc

byte-compiling /build/logilab-common-1.3.0/testing/usr/lib/python2.7/dist-packages/logilab/common/decorators.py to decorators.pyc

byte-compiling /build/logilab-common-1.3.0/testing/usr/lib/python2.7/dist-packages/logilab/common/daemon.py to daemon.pyc

byte-compiling /build/logilab-common-1.3.0/testing/usr/lib/python2.7/dist-packages/logilab/common/shellutils.py to shellutils.pyc

byte-compiling /build/logilab-common-1.3.0/testing/usr/lib/python2.7/dist-packages/logilab/common/configuration.py to configuration.pyc

byte-compiling /build/logilab-common-1.3.0/testing/usr/lib/python2.7/dist-packages/logilab/common/optparser.py to optparser.pyc

byte-compiling /build/logilab-common-1.3.0/testing/usr/lib/python2.7/dist-packages/logilab/common/deprecation.py to deprecation.pyc

byte-compiling /build/logilab-common-1.3.0/testing/usr/lib/python2.7/dist-packages/logilab/common/optik_ext.py to optik_ext.pyc

byte-compiling /build/logilab-common-1.3.0/testing/usr/lib/python2.7/dist-packages/logilab/common/umessage.py to umessage.pyc

byte-compiling /build/logilab-common-1.3.0/testing/usr/lib/python2.7/dist-packages/logilab/common/interface.py to interface.pyc

byte-compiling /build/logilab-common-1.3.0/testing/usr/lib/python2.7/dist-packages/logilab/common/ureports/html_writer.py to html_writer.pyc

byte-compiling /build/logilab-common-1.3.0/testing/usr/lib/python2.7/dist-packages/logilab/common/ureports/nodes.py to nodes.pyc

byte-compiling /build/logilab-common-1.3.0/testing/usr/lib/python2.7/dist-packages/logilab/common/ureports/docbook_writer.py to docbook_writer.pyc

byte-compiling /build/logilab-common-1.3.0/testing/usr/lib/python2.7/dist-packages/logilab/common/ureports/__init__.py to __init__.pyc

byte-compiling /build/logilab-common-1.3.0/testing/usr/lib/python2.7/dist-packages/logilab/common/ureports/text_writer.py to text_writer.pyc

running install_egg_info

running egg_info

creating logilab_common.egg-info

writing requirements to logilab_common.egg-info/requires.txt

writing logilab_common.egg-info/PKG-INFO

writing namespace_packages to logilab_common.egg-info/namespace_packages.txt

writing top-level names to logilab_common.egg-info/top_level.txt

writing dependency_links to logilab_common.egg-info/dependency_links.txt

writing manifest file &#39;logilab_common.egg-info/SOURCES.txt&#39;

reading manifest file &#39;logilab_common.egg-info/SOURCES.txt&#39;

reading manifest template &#39;MANIFEST.in&#39;

warning: no files found matching &#39;*.py&#39; under directory &#39;test/input&#39;

warning: no files found matching &#39;*&#39; under directory &#39;doc/html&#39;

writing manifest file &#39;logilab_common.egg-info/SOURCES.txt&#39;

Copying logilab_common.egg-info to /build/logilab-common-1.3.0/testing/usr/lib/python2.7/dist-packages/logilab_common-1.3.0.egg-info

Skipping SOURCES.txt

Installing /build/logilab-common-1.3.0/testing/usr/lib/python2.7/dist-packages/logilab_common-1.3.0-nspkg.pth

running install_scripts

creating /build/logilab-common-1.3.0/testing/usr/bin

copying build/scripts-2.7/logilab-pytest -&gt; /build/logilab-common-1.3.0/testing/usr/bin

changing mode of /build/logilab-common-1.3.0/testing/usr/bin/logilab-pytest to 755

echo &#39;import site, os.path; site.addsitedir(os.path.dirname(__file__))&#39; &gt; testing//usr/lib/python2.7/dist-packages/sitecustomize.py

PYTHONPATH=/build/logilab-common-1.3.0/testing//usr/lib/python2.7/dist-packages python -m logilab.common.pytest -t /build/logilab-common-1.3.0/test

======================== unittest_pytest.py ========================

.....

======================== unittest_graph.py =========================

..............

======================== unittest_cache.py =========================

........

======================= unittest_testlib.py ========================

...........................................................................................

===================== unittest_deprecation.py ======================

.......

====================== unittest_interface.py =======================

.....

========================= unittest_date.py =========================

......................................................

==================== unittest_ureports_html.py =====================

.......

==================== unittest_configuration.py =====================

..................

======================== unittest_table.py =========================

.....................................

====================== unittest_changelog.py =======================

.

======================= unittest_registry.py =======================

............

====================== unittest_shellutils.py ======================

..................

========================= unittest_tree.py =========================

........................

======================= unittest_umessage.py =======================

.......

====================== unittest_fileutils.py =======================

............

======================= unittest_xmlutils.py =======================

.....

====================== unittest_textutils.py =======================

.........................................

====================== unittest_taskqueue.py =======================

.....

======================= unittest_modutils.py =======================

....................................

==================== unittest_ureports_text.py =====================

.......

====================== unittest_decorators.py ======================

.............

*******************************************************************************

Ran 427 test cases in 0.16s (0.15s CPU)

All 22 modules OK

Traceback (most recent call last):

File &quot;/usr/lib/python2.7/runpy.py&quot;, line 174, in _run_module_as_main

&quot;__main__&quot;, fname, loader, pkg_name)

File &quot;/usr/lib/python2.7/runpy.py&quot;, line 72, in _run_code

exec code in run_globals

File &quot;/build/logilab-common-1.3.0/testing/usr/lib/python2.7/dist-packages/logilab/common/pytest.py&quot;, line 1303, in &lt;module&gt;

run()

File &quot;/build/logilab-common-1.3.0/testing/usr/lib/python2.7/dist-packages/logilab/common/deprecation.py&quot;, line 84, in wrapped

return func(*args, **kwargs)

File &quot;/build/logilab-common-1.3.0/testing/usr/lib/python2.7/dist-packages/logilab/common/pytest.py&quot;, line 672, in run

sys.exit(tester.errcode)

AttributeError: &#39;NoneType&#39; object has no attribute &#39;exit&#39;

debian/rules:69: recipe for target &#39;override_dh_auto_test&#39; failed

make[1]: *** [override_dh_auto_test] Error 1

make[1]: Leaving directory &#39;/build/logilab-common-1.3.0&#39;

debian/rules:30: recipe for target &#39;build-indep&#39; failed

make: *** [build-indep] Error 2

dpkg-buildpackage: error: debian/rules build gave error exit status 2

[0mI: copying local configuration [0m

[0;31mE: Failed autobuilding of package [0m

[0mI: user script /var/cache/pbuilder/build/10916/tmp/hooks/C10shell starting [0m

If you want to enter into the chroot image to debug, you have to edit your ~/.pbuilderrc with:

export LGP_AUTO_ENTER_SHELL=y

[0mI: user script /var/cache/pbuilder/build/10916/tmp/hooks/C10shell finished [0m

[0mI: unmounting /sys filesystem [0m

[0mI: unmounting /dev filesystem [0m

[0mI: unmounting dev/pts filesystem [0m

[0mI: unmounting run/shm filesystem [0m

[0mI: unmounting proc filesystem [0m

[0mI: unmounting sys filesystem [0m

[0mI: cleaning the build env [0m

[0mI: removing directory /var/cache/pbuilder/build/10916 and its subdirectories [0m
<br/>20 printing /tmp/tmp3xvLni/common/../jessie/logilab-common_1.3.0-1~revf3ab15166db9_amd64_jessie.lgp-build.log: [0mI: Using pkgname logfile [0m

[0mI: Current time: Fri Nov 18 13:09:41 CET 2016 [0m

[0mI: pbuilder-time-stamp: 1479470981 [0m

[0mI: Obtaining the cached apt archive contents [0m

[0mI: Installing the build-deps [0m

[0mI: user script /var/cache/pbuilder/build/5204/tmp/hooks/D10tmp starting [0m

[0mI: user script /var/cache/pbuilder/build/5204/tmp/hooks/D10tmp finished [0m

[0mI: user script /var/cache/pbuilder/build/5204/tmp/hooks/D50debconf starting [0m

[0mI: user script /var/cache/pbuilder/build/5204/tmp/hooks/D50debconf finished [0m

[0mI: user script /var/cache/pbuilder/build/5204/tmp/hooks/D99apt starting [0m

+ apt-get update

[0mI: user script /var/cache/pbuilder/build/5204/tmp/hooks/D99apt finished [0m

-&gt; Attempting to satisfy build-dependencies

-&gt; Creating pbuilder-satisfydepends-dummy package

Package: pbuilder-satisfydepends-dummy

Version: 0.invalid.0

Architecture: amd64

Maintainer: Debian Pbuilder Team &lt;pbuilder-maint@lists.alioth.debian.org&gt;

Description: Dummy package to satisfy dependencies with aptitude - created by pbuilder

This package was created automatically by pbuilder to satisfy the

build-dependencies of the package being currently built.

Depends: debhelper (&gt;= 8), python-all, python-setuptools, python3-all, python3-setuptools, python-epydoc, graphviz, python-unittest2, python-egenix-mxdatetime, python-tz, python3-tz | python3 (&lt;&lt; 3.3), python-six (&gt;= 1.4.0), python3-six (&gt;= 1.4.0) | python3 (&lt;&lt; 3.3)

dpkg-deb: building package `pbuilder-satisfydepends-dummy&#39; in `/tmp/satisfydepends-aptitude/pbuilder-satisfydepends-dummy.deb&#39;.

Selecting previously unselected package pbuilder-satisfydepends-dummy.

(Reading database ... 12586 files and directories currently installed.)

Preparing to unpack .../pbuilder-satisfydepends-dummy.deb ...

Unpacking pbuilder-satisfydepends-dummy (0.invalid.0) ...

dpkg: pbuilder-satisfydepends-dummy: dependency problems, but configuring anyway as you requested:

pbuilder-satisfydepends-dummy depends on debhelper (&gt;= 8); however:

Package debhelper is not installed.

pbuilder-satisfydepends-dummy depends on python-all; however:

Package python-all is not installed.

pbuilder-satisfydepends-dummy depends on python-setuptools; however:

Package python-setuptools is not installed.

pbuilder-satisfydepends-dummy depends on python3-all; however:

Package python3-all is not installed.

pbuilder-satisfydepends-dummy depends on python3-setuptools; however:

Package python3-setuptools is not installed.

pbuilder-satisfydepends-dummy depends on python-epydoc; however:

Package python-epydoc is not installed.

pbuilder-satisfydepends-dummy depends on graphviz; however:

Package graphviz is not installed.

pbuilder-satisfydepends-dummy depends on python-unittest2; however:

Package python-unittest2 is not installed.

pbuilder-satisfydepends-dummy depends on python-egenix-mxdatet

Setting up pbuilder-satisfydepends-dummy (0.invalid.0) ...

Reading package lists...

Building dependency tree...

Reading state information...

Initializing package states...

Writing extended state information...

Building tag database...

The following NEW packages will be installed:

bsdmainutils{a} debhelper{a} dh-python{a} file{a} fontconfig{a}

fontconfig-config{a} fonts-dejavu-core{a} gettext{a} gettext-base{a}

graphviz{a} groff-base{a} intltool-debian{a} libasprintf0c2{a}

libcairo2{a} libcdt5{a} libcgraph6{a} libcroco3{a} libdatrie1{a}

libexpat1{a} libfontconfig1{a} libfreetype6{a} libgd3{a} libglib2.0-0{a}

libgraphite2-3{a} libgvc6{a} libgvpr2{a} libharfbuzz0b{a} libice6{a}

libjbig0{a} libjpeg62-turbo{a} libltdl7{a} libmagic1{a} libmpdec2{a}

libpango-1.0-0{a} libpangocairo-1.0-0{a} libpangoft2-1.0-0{a}

libpathplan4{a} libpipeline1{a} libpixman-1-0{a} libpng12-0{a}

libpython-stdlib{a} libpython2.7-minimal{a} libpython2.7-stdlib{a}

libpython3-stdlib{a} libpython3.4-minimal{a} libpython3.4-stdlib{a}

libsm6{a} libthai-data{a} libthai0{a} libtiff5{a} libunistring0{a}

libvpx1{a} libx11-6{a} libx11-data{a} libxau6{a} libxaw7{a}

libxcb-render0{a} libxcb-shm0{a} libxcb1{a} libxdmcp6{a} libxdot4{a}

libxext6{a} libxml2{a} libxmu6{a} libxpm4{a} libxrender1{a} libxt6{a}

man-db{a} mime-support{a} po-debconf{a} python{a} python-all{a}

python-egenix-mxdatetime{a} python-egenix-mxtools{a} python-epydoc{a}

python-minimal{a} python-pkg-resources{a} python-setuptools{a}

python-six{a} python-support{a} python-tz{a} python-unittest2{a}

python2.7{a} python2.7-minimal{a} python3{a} python3-all{a}

python3-minimal{a} python3-pkg-resources{a} python3-setuptools{a}

python3-six{a} python3-tz{a} python3.4{a} python3.4-minimal{a} ucf{a}

x11-common{a}

0 packages upgraded, 95 newly installed, 0 to remove and 0 not upgraded.

Need to get 0 B/29.1 MB of archives. After unpacking 100 MB will be used.

Writing extended state information...

Extracting templates from packages: 31%
Extracting templates from packages: 63%
Extracting templates from packages: 94%
Extracting templates from packages: 100%

Preconfiguring packages ...

E: Can not write log (Is /dev/pts mounted?) - posix_openpt (2: No such file or directory)

Selecting previously unselected package libpipeline1:amd64.

(Reading database ... 12586 files and directories currently installed.)

Preparing to unpack .../libpipeline1_1.4.0-1_amd64.deb ...

Unpacking libpipeline1:amd64 (1.4.0-1) ...

Selecting previously unselected package groff-base.

Preparing to unpack .../groff-base_1.22.2-8_amd64.deb ...

Unpacking groff-base (1.22.2-8) ...

Selecting previously unselected package bsdmainutils.

Preparing to unpack .../bsdmainutils_9.0.6_amd64.deb ...

Unpacking bsdmainutils (9.0.6) ...

Selecting previously unselected package man-db.

Preparing to unpack .../man-db_2.7.0.2-5_amd64.deb ...

Unpacking man-db (2.7.0.2-5) ...

Selecting previously unselected package libasprintf0c2:amd64.

Preparing to unpack .../libasprintf0c2_0.19.3-2_amd64.deb ...

Unpacking libasprintf0c2:amd64 (0.19.3-2) ...

Selecting previously unselected package libmagic1:amd64.

Preparing to unpack .../libmagic1_1%3a5.22+15-2+deb8u2_amd64.deb ...

Unpacking libmagic1:amd64 (1:5.22+15-2+deb8u2) ...

Selecting previously unselected package libxml2:amd64.

Preparing to unpack .../libxml2_2.9.1+dfsg1-5+deb8u3_amd64.deb ...

Unpacking libxml2:amd64 (2.9.1+dfsg1-5+deb8u3) ...

Selecting previously unselected package libpython2.7-minimal:amd64.

Preparing to unpack .../libpython2.7-minimal_2.7.9-2+deb8u1_amd64.deb ...

Unpacking libpython2.7-minimal:amd64 (2.7.9-2+deb8u1) ...

Selecting previously unselected package python2.7-minimal.

Preparing to unpack .../python2.7-minimal_2.7.9-2+deb8u1_amd64.deb ...

Unpacking python2.7-minimal (2.7.9-2+deb8u1) ...

Selecting previously unselected package python-minimal.

Preparing to unpack .../python-minimal_2.7.9-1_amd64.deb ...

Unpacking python-minimal (2.7.9-1) ...

Selecting previously unselected package mime-support.

Preparing to unpack .../mime-support_3.58_all.deb ...

Unpacking mime-support (3.58) ...

Selecting previously unselected package libexpat1:amd64.

Preparing to unpack .../libexpat1_2.1.0-6+deb8u3_amd64.deb ...

Unpacking libexpat1:amd64 (2.1.0-6+deb8u3) ...

Selecting previously unselected package libpython2.7-stdlib:amd64.

Preparing to unpack .../libpython2.7-stdlib_2.7.9-2+deb8u1_amd64.deb ...

Unpacking libpython2.7-stdlib:amd64 (2.7.9-2+deb8u1) ...

Selecting previously unselected package python2.7.

Preparing to unpack .../python2.7_2.7.9-2+deb8u1_amd64.deb ...

Unpacking python2.7 (2.7.9-2+deb8u1) ...

Selecting previously unselected package libpython-stdlib:amd64.

Preparing to unpack .../libpython-stdlib_2.7.9-1_amd64.deb ...

Unpacking libpython-stdlib:amd64 (2.7.9-1) ...

Setting up libpython2.7-minimal:amd64 (2.7.9-2+deb8u1) ...

Setting up python2.7-minimal (2.7.9-2+deb8u1) ...

Setting up python-minimal (2.7.9-1) ...

Selecting previously unselected package python.

(Reading database ... 13951 files and directories currently installed.)

Preparing to unpack .../python_2.7.9-1_amd64.deb ...

Unpacking python (2.7.9-1) ...

Selecting previously unselected package libpng12-0:amd64.

Preparing to unpack .../libpng12-0_1.2.50-2+deb8u2_amd64.deb ...

Unpacking libpng12-0:amd64 (1.2.50-2+deb8u2) ...

Selecting previously unselected package libfreetype6:amd64.

Preparing to unpack .../libfreetype6_2.5.2-3+deb8u1_amd64.deb ...

Unpacking libfreetype6:amd64 (2.5.2-3+deb8u1) ...

Selecting previously unselected package ucf.

Preparing to unpack .../archives/ucf_3.0030_all.deb ...

Moving old data out of the way

Unpacking ucf (3.0030) ...

Selecting previously unselected package fonts-dejavu-core.

Preparing to unpack .../fonts-dejavu-core_2.34-1_all.deb ...

Unpacking fonts-dejavu-core (2.34-1) ...

Selecting previously unselected package fontconfig-config.

Preparing to unpack .../fontconfig-config_2.11.0-6.3+deb8u1_all.deb ...

Unpacking fontconfig-config (2.11.0-6.3+deb8u1) ...

Selecting previously unselected package libfontconfig1:amd64.

Preparing to unpack .../libfontconfig1_2.11.0-6.3+deb8u1_amd64.deb ...

Unpacking libfontconfig1:amd64 (2.11.0-6.3+deb8u1) ...

Selecting previously unselected package fontconfig.

Preparing to unpack .../fontconfig_2.11.0-6.3+deb8u1_amd64.deb ...

Unpacking fontconfig (2.11.0-6.3+deb8u1) ...

Selecting previously unselected package libpixman-1-0:amd64.

Preparing to unpack .../libpixman-1-0_0.32.6-3_amd64.deb ...

Unpacking libpixman-1-0:amd64 (0.32.6-3) ...

Selecting previously unselected package libxau6:amd64.

Preparing to unpack .../libxau6_1%3a1.0.8-1_amd64.deb ...

Unpacking libxau6:amd64 (1:1.0.8-1) ...

Selecting previously unselected package libxdmcp6:amd64.

Preparing to unpack .../libxdmcp6_1%3a1.1.1-1+b1_amd64.deb ...

Unpacking libxdmcp6:amd64 (1:1.1.1-1+b1) ...

Selecting previously unselected package libxcb1:amd64.

Preparing to unpack .../libxcb1_1.10-3+b1_amd64.deb ...

Unpacking libxcb1:amd64 (1.10-3+b1) ...

Selecting previously unselected package libx11-data.

Preparing to unpack .../libx11-data_2%3a1.6.2-3_all.deb ...

Unpacking libx11-data (2:1.6.2-3) ...

Selecting previously unselected package libx11-6:amd64.

Preparing to unpack .../libx11-6_2%3a1.6.2-3_amd64.deb ...

Unpacking libx11-6:amd64 (2:1.6.2-3) ...

Selecting previously unselected package libxcb-render0:amd64.

Preparing to unpack .../libxcb-render0_1.10-3+b1_amd64.deb ...

Unpacking libxcb-render0:amd64 (1.10-3+b1) ...

Selecting previously unselected package libxcb-shm0:amd64.

Preparing to unpack .../libxcb-shm0_1.10-3+b1_amd64.deb ...

Unpacking libxcb-shm0:amd64 (1.10-3+b1) ...

Selecting previously unselected package libxext6:amd64.

Preparing to unpack .../libxext6_2%3a1.3.3-1_amd64.deb ...

Unpacking libxext6:amd64 (2:1.3.3-1) ...

Selecting previously unselected package libxrender1:amd64.

Preparing to unpack .../libxrender1_1%3a0.9.8-1+b1_amd64.deb ...

Unpacking libxrender1:amd64 (1:0.9.8-1+b1) ...

Selecting previously unselected package libcairo2:amd64.

Preparing to unpack .../libcairo2_1.14.0-2.1+deb8u1_amd64.deb ...

Unpacking libcairo2:amd64 (1.14.0-2.1+deb8u1) ...

Selecting previously unselected package libglib2.0-0:amd64.

Preparing to unpack .../libglib2.0-0_2.42.1-1+b1_amd64.deb ...

Unpacking libglib2.0-0:amd64 (2.42.1-1+b1) ...

Selecting previously unselected package libcroco3:amd64.

Preparing to unpack .../libcroco3_0.6.8-3+b1_amd64.deb ...

Unpacking libcroco3:amd64 (0.6.8-3+b1) ...

Selecting previously unselected package libdatrie1:amd64.

Preparing to unpack .../libdatrie1_0.2.8-1_amd64.deb ...

Unpacking libdatrie1:amd64 (0.2.8-1) ...

Selecting previously unselected package libjpeg62-turbo:amd64.

Preparing to unpack .../libjpeg62-turbo_1%3a1.3.1-12_amd64.deb ...

Unpacking libjpeg62-turbo:amd64 (1:1.3.1-12) ...

Selecting previously unselected package libjbig0:amd64.

Preparing to unpack .../libjbig0_2.1-3.1_amd64.deb ...

Unpacking libjbig0:amd64 (2.1-3.1) ...

Selecting previously unselected package libtiff5:amd64.

Preparing to unpack .../libtiff5_4.0.3-12.3+deb8u1_amd64.deb ...

Unpacking libtiff5:amd64 (4.0.3-12.3+deb8u1) ...

Selecting previously unselected package libvpx1:amd64.

Preparing to unpack .../libvpx1_1.3.0-3_amd64.deb ...

Unpacking libvpx1:amd64 (1.3.0-3) ...

Selecting previously unselected package libxpm4:amd64.

Preparing to unpack .../libxpm4_1%3a3.5.11-1+b1_amd64.deb ...

Unpacking libxpm4:amd64 (1:3.5.11-1+b1) ...

Selecting previously unselected package libgd3:amd64.

Preparing to unpack .../libgd3_2.1.0-5+deb8u6_amd64.deb ...

Unpacking libgd3:amd64 (2.1.0-5+deb8u6) ...

Selecting previously unselected package libgraphite2-3:amd64.

Preparing to unpack .../libgraphite2-3_1.3.6-1~deb8u1_amd64.deb ...

Unpacking libgraphite2-3:amd64 (1.3.6-1~deb8u1) ...

Selecting previously unselected package libharfbuzz0b:amd64.

Preparing to unpack .../libharfbuzz0b_0.9.35-2_amd64.deb ...

Unpacking libharfbuzz0b:amd64 (0.9.35-2) ...

Selecting previously unselected package x11-common.

Preparing to unpack .../x11-common_1%3a7.7+7_all.deb ...

Unpacking x11-common (1:7.7+7) ...

Selecting previously unselected package libice6:amd64.

Preparing to unpack .../libice6_2%3a1.0.9-1+b1_amd64.deb ...

Unpacking libice6:amd64 (2:1.0.9-1+b1) ...

Selecting previously unselected package libltdl7:amd64.

Preparing to unpack .../libltdl7_2.4.2-1.11+b1_amd64.deb ...

Unpacking libltdl7:amd64 (2.4.2-1.11+b1) ...

Selecting previously unselected package libmpdec2:amd64.

Preparing to unpack .../libmpdec2_2.4.1-1_amd64.deb ...

Unpacking libmpdec2:amd64 (2.4.1-1) ...

Selecting previously unselected package libthai-data.

Preparing to unpack .../libthai-data_0.1.21-1_all.deb ...

Unpacking libthai-data (0.1.21-1) ...

Selecting previously unselected package libthai0:amd64.

Preparing to unpack .../libthai0_0.1.21-1_amd64.deb ...

Unpacking libthai0:amd64 (0.1.21-1) ...

Selecting previously unselected package libpango-1.0-0:amd64.

Preparing to unpack .../libpango-1.0-0_1.36.8-3_amd64.deb ...

Unpacking libpango-1.0-0:amd64 (1.36.8-3) ...

Selecting previously unselected package libpangoft2-1.0-0:amd64.

Preparing to unpack .../libpangoft2-1.0-0_1.36.8-3_amd64.deb ...

Unpacking libpangoft2-1.0-0:amd64 (1.36.8-3) ...

Selecting previously unselected package libpangocairo-1.0-0:amd64.

Preparing to unpack .../libpangocairo-1.0-0_1.36.8-3_amd64.deb ...

Unpacking libpangocairo-1.0-0:amd64 (1.36.8-3) ...

Selecting previously unselected package libpython3.4-minimal:amd64.

Preparing to unpack .../libpython3.4-minimal_3.4.2-1_amd64.deb ...

Unpacking libpython3.4-minimal:amd64 (3.4.2-1) ...

Selecting previously unselected package libpython3.4-stdlib:amd64.

Preparing to unpack .../libpython3.4-stdlib_3.4.2-1_amd64.deb ...

Unpacking libpython3.4-stdlib:amd64 (3.4.2-1) ...

Selecting previously unselected package libsm6:amd64.

Preparing to unpack .../libsm6_2%3a1.2.2-1+b1_amd64.deb ...

Unpacking libsm6:amd64 (2:1.2.2-1+b1) ...

Selecting previously unselected package libunistring0:amd64.

Preparing to unpack .../libunistring0_0.9.3-5.2+b1_amd64.deb ...

Unpacking libunistring0:amd64 (0.9.3-5.2+b1) ...

Selecting previously unselected package libxt6:amd64.

Preparing to unpack .../libxt6_1%3a1.1.4-1+b1_amd64.deb ...

Unpacking libxt6:amd64 (1:1.1.4-1+b1) ...

Selecting previously unselected package libxmu6:amd64.

Preparing to unpack .../libxmu6_2%3a1.1.2-1_amd64.deb ...

Unpacking libxmu6:amd64 (2:1.1.2-1) ...

Selecting previously unselected package libxaw7:amd64.

Preparing to unpack .../libxaw7_2%3a1.0.12-2+b1_amd64.deb ...

Unpacking libxaw7:amd64 (2:1.0.12-2+b1) ...

Selecting previously unselected package python3.4-minimal.

Preparing to unpack .../python3.4-minimal_3.4.2-1_amd64.deb ...

Unpacking python3.4-minimal (3.4.2-1) ...

Selecting previously unselected package file.

Preparing to unpack .../file_1%3a5.22+15-2+deb8u2_amd64.deb ...

Unpacking file (1:5.22+15-2+deb8u2) ...

Selecting previously unselected package gettext-base.

Preparing to unpack .../gettext-base_0.19.3-2_amd64.deb ...

Unpacking gettext-base (0.19.3-2) ...

Selecting previously unselected package python-support.

Preparing to unpack .../python-support_1.0.15_all.deb ...

Unpacking python-support (1.0.15) ...

Selecting previously unselected package gettext.

Preparing to unpack .../gettext_0.19.3-2_amd64.deb ...

Unpacking gettext (0.19.3-2) ...

Selecting previously unselected package intltool-debian.

Preparing to unpack .../intltool-debian_0.35.0+20060710.1_all.deb ...

Unpacking intltool-debian (0.35.0+20060710.1) ...

Selecting previously unselected package po-debconf.

Preparing to unpack .../po-debconf_1.0.16+nmu3_all.deb ...

Unpacking po-debconf (1.0.16+nmu3) ...

Selecting previously unselected package debhelper.

Preparing to unpack .../debhelper_9.20150101+deb8u2_all.deb ...

Unpacking debhelper (9.20150101+deb8u2) ...

Selecting previously unselected package python3.4.

Preparing to unpack .../python3.4_3.4.2-1_amd64.deb ...

Unpacking python3.4 (3.4.2-1) ...

Selecting previously unselected package python3-minimal.

Preparing to unpack .../python3-minimal_3.4.2-2_amd64.deb ...

Unpacking python3-minimal (3.4.2-2) ...

Selecting previously unselected package libpython3-stdlib:amd64.

Preparing to unpack .../libpython3-stdlib_3.4.2-2_amd64.deb ...

Unpacking libpython3-stdlib:amd64 (3.4.2-2) ...

Selecting previously unselected package python3.

Preparing to unpack .../python3_3.4.2-2_amd64.deb ...

Unpacking python3 (3.4.2-2) ...

Selecting previously unselected package dh-python.

Preparing to unpack .../dh-python_1.20141111-2_all.deb ...

Unpacking dh-python (1.20141111-2) ...

Selecting previously unselected package libcdt5.

Preparing to unpack .../libcdt5_2.38.0-7_amd64.deb ...

Unpacking libcdt5 (2.38.0-7) ...

Selecting previously unselected package libcgraph6.

Preparing to unpack .../libcgraph6_2.38.0-7_amd64.deb ...

Unpacking libcgraph6 (2.38.0-7) ...

Selecting previously unselected package libpathplan4.

Preparing to unpack .../libpathplan4_2.38.0-7_amd64.deb ...

Unpacking libpathplan4 (2.38.0-7) ...

Selecting previously unselected package libxdot4.

Preparing to unpack .../libxdot4_2.38.0-7_amd64.deb ...

Unpacking libxdot4 (2.38.0-7) ...

Selecting previously unselected package libgvc6.

Preparing to unpack .../libgvc6_2.38.0-7_amd64.deb ...

Unpacking libgvc6 (2.38.0-7) ...

Selecting previously unselected package libgvpr2.

Preparing to unpack .../libgvpr2_2.38.0-7_amd64.deb ...

Unpacking libgvpr2 (2.38.0-7) ...

Selecting previously unselected package graphviz.

Preparing to unpack .../graphviz_2.38.0-7_amd64.deb ...

Unpacking graphviz (2.38.0-7) ...

Selecting previously unselected package python-all.

Preparing to unpack .../python-all_2.7.9-1_amd64.deb ...

Unpacking python-all (2.7.9-1) ...

Selecting previously unselected package python-egenix-mxtools.

Preparing to unpack .../python-egenix-mxtools_3.2.8-1_amd64.deb ...

Unpacking python-egenix-mxtools (3.2.8-1) ...

Selecting previously unselected package python-egenix-mxdatetime.

Preparing to unpack .../python-egenix-mxdatetime_3.2.8-1_amd64.deb ...

Unpacking python-egenix-mxdatetime (3.2.8-1) ...

Selecting previously unselected package python-epydoc.

Preparing to unpack .../python-epydoc_3.0.1+dfsg-5_all.deb ...

Unpacking python-epydoc (3.0.1+dfsg-5) ...

Selecting previously unselected package python-pkg-resources.

Preparing to unpack .../python-pkg-resources_5.5.1-1_all.deb ...

Unpacking python-pkg-resources (5.5.1-1) ...

Selecting previously unselected package python-setuptools.

Preparing to unpack .../python-setuptools_5.5.1-1_all.deb ...

Unpacking python-setuptools (5.5.1-1) ...

Selecting previously unselected package python-six.

Preparing to unpack .../python-six_1.8.0-1_all.deb ...

Unpacking python-six (1.8.0-1) ...

Selecting previously unselected package python-tz.

Preparing to unpack .../python-tz_2012c+dfsg-0.1_all.deb ...

Unpacking python-tz (2012c+dfsg-0.1) ...

Selecting previously unselected package python-unittest2.

Preparing to unpack .../python-unittest2_0.5.1-1_all.deb ...

Unpacking python-unittest2 (0.5.1-1) ...

Selecting previously unselected package python3-all.

Preparing to unpack .../python3-all_3.4.2-2_amd64.deb ...

Unpacking python3-all (3.4.2-2) ...

Selecting previously unselected package python3-pkg-resources.

Preparing to unpack .../python3-pkg-resources_5.5.1-1_all.deb ...

Unpacking python3-pkg-resources (5.5.1-1) ...

Selecting previously unselected package python3-setuptools.

Preparing to unpack .../python3-setuptools_5.5.1-1_all.deb ...

Unpacking python3-setuptools (5.5.1-1) ...

Selecting previously unselected package python3-six.

Preparing to unpack .../python3-six_1.8.0-1_all.deb ...

Unpacking python3-six (1.8.0-1) ...

Selecting previously unselected package python3-tz.

Preparing to unpack .../python3-tz_2012c+dfsg-0.1_all.deb ...

Unpacking python3-tz (2012c+dfsg-0.1) ...

Setting up libpipeline1:amd64 (1.4.0-1) ...

Setting up groff-base (1.22.2-8) ...

Setting up bsdmainutils (9.0.6) ...

update-alternatives: using /usr/bin/bsd-write to provide /usr/bin/write (write) in auto mode

update-alternatives: using /usr/bin/bsd-from to provide /usr/bin/from (from) in auto mode

Setting up man-db (2.7.0.2-5) ...

Not building database; man-db/auto-update is not &#39;true&#39;.

Setting up libasprintf0c2:amd64 (0.19.3-2) ...

Setting up libmagic1:amd64 (1:5.22+15-2+deb8u2) ...

Setting up libxml2:amd64 (2.9.1+dfsg1-5+deb8u3) ...

Setting up mime-support (3.58) ...

Setting up libexpat1:amd64 (2.1.0-6+deb8u3) ...

Setting up libpython2.7-stdlib:amd64 (2.7.9-2+deb8u1) ...

Setting up python2.7 (2.7.9-2+deb8u1) ...

Setting up libpython-stdlib:amd64 (2.7.9-1) ...

Setting up python (2.7.9-1) ...

Setting up libpng12-0:amd64 (1.2.50-2+deb8u2) ...

Setting up libfreetype6:amd64 (2.5.2-3+deb8u1) ...

Setting up ucf (3.0030) ...

Setting up fonts-dejavu-core (2.34-1) ...

Setting up fontconfig-config (2.11.0-6.3+deb8u1) ...

Setting up libfontconfig1:amd64 (2.11.0-6.3+deb8u1) ...

Setting up fontconfig (2.11.0-6.3+deb8u1) ...

Regenerating fonts cache... done.

Setting up libpixman-1-0:amd64 (0.32.6-3) ...

Setting up libxau6:amd64 (1:1.0.8-1) ...

Setting up libxdmcp6:amd64 (1:1.1.1-1+b1) ...

Setting up libxcb1:amd64 (1.10-3+b1) ...

Setting up libx11-data (2:1.6.2-3) ...

Setting up libx11-6:amd64 (2:1.6.2-3) ...

Setting up libxcb-render0:amd64 (1.10-3+b1) ...

Setting up libxcb-shm0:amd64 (1.10-3+b1) ...

Setting up libxext6:amd64 (2:1.3.3-1) ...

Setting up libxrender1:amd64 (1:0.9.8-1+b1) ...

Setting up libcairo2:amd64 (1.14.0-2.1+deb8u1) ...

Setting up libglib2.0-0:amd64 (2.42.1-1+b1) ...

No schema files found: doing nothing.

Setting up libcroco3:amd64 (0.6.8-3+b1) ...

Setting up libdatrie1:amd64 (0.2.8-1) ...

Setting up libjpeg62-turbo:amd64 (1:1.3.1-12) ...

Setting up libjbig0:amd64 (2.1-3.1) ...

Setting up libtiff5:amd64 (4.0.3-12.3+deb8u1) ...

Setting up libvpx1:amd64 (1.3.0-3) ...

Setting up libxpm4:amd64 (1:3.5.11-1+b1) ...

Setting up libgd3:amd64 (2.1.0-5+deb8u6) ...

Setting up libgraphite2-3:amd64 (1.3.6-1~deb8u1) ...

Setting up libharfbuzz0b:amd64 (0.9.35-2) ...

Setting up x11-common (1:7.7+7) ...

update-rc.d: warning: start and stop actions are no longer supported; falling back to defaults

Setting up X socket directories... /tmp/.X11-unix /tmp/.ICE-unix.

Setting up libice6:amd64 (2:1.0.9-1+b1) ...

Setting up libltdl7:amd64 (2.4.2-1.11+b1) ...

Setting up libmpdec2:amd64 (2.4.1-1) ...

Setting up libthai-data (0.1.21-1) ...

Setting up libthai0:amd64 (0.1.21-1) ...

Setting up libpango-1.0-0:amd64 (1.36.8-3) ...

Setting up libpangoft2-1.0-0:amd64 (1.36.8-3) ...

Setting up libpangocairo-1.0-0:amd64 (1.36.8-3) ...

Setting up libpython3.4-minimal:amd64 (3.4.2-1) ...

Setting up libpython3.4-stdlib:amd64 (3.4.2-1) ...

Setting up libsm6:amd64 (2:1.2.2-1+b1) ...

Setting up libunistring0:amd64 (0.9.3-5.2+b1) ...

Setting up libxt6:amd64 (1:1.1.4-1+b1) ...

Setting up libxmu6:amd64 (2:1.1.2-1) ...

Setting up libxaw7:amd64 (2:1.0.12-2+b1) ...

Setting up python3.4-minimal (3.4.2-1) ...

Setting up file (1:5.22+15-2+deb8u2) ...

Setting up gettext-base (0.19.3-2) ...

Setting up python-support (1.0.15) ...

Setting up gettext (0.19.3-2) ...

Setting up intltool-debian (0.35.0+20060710.1) ...

Setting up po-debconf (1.0.16+nmu3) ...

Setting up debhelper (9.20150101+deb8u2) ...

Setting up python3.4 (3.4.2-1) ...

Setting up python3-minimal (3.4.2-2) ...

Setting up libpython3-stdlib:amd64 (3.4.2-2) ...

Setting up libcdt5 (2.38.0-7) ...

Setting up libcgraph6 (2.38.0-7) ...

Setting up libpathplan4 (2.38.0-7) ...

Setting up libxdot4 (2.38.0-7) ...

Setting up libgvc6 (2.38.0-7) ...

Setting up libgvpr2 (2.38.0-7) ...

Setting up graphviz (2.38.0-7) ...

Setting up python-all (2.7.9-1) ...

Setting up python-egenix-mxtools (3.2.8-1) ...

Setting up python-egenix-mxdatetime (3.2.8-1) ...

Setting up python-epydoc (3.0.1+dfsg-5) ...

Setting up python-pkg-resources (5.5.1-1) ...

Setting up python-setuptools (5.5.1-1) ...

Setting up python-six (1.8.0-1) ...

Setting up python-tz (2012c+dfsg-0.1) ...

Setting up python-unittest2 (0.5.1-1) ...

Setting up python3 (3.4.2-2) ...

Setting up dh-python (1.20141111-2) ...

Setting up python3-all (3.4.2-2) ...

Setting up python3-pkg-resources (5.5.1-1) ...

Setting up python3-setuptools (5.5.1-1) ...

Setting up python3-six (1.8.0-1) ...

Setting up python3-tz (2012c+dfsg-0.1) ...

Processing triggers for libc-bin (2.19-18+deb8u6) ...

Processing triggers for python-support (1.0.15) ...

Reading package lists...

Building dependency tree...

Reading state information...

Reading extended state information...

Initializing package states...

Writing extended state information...

Building tag database...

-&gt; Finished parsing the build-deps

Reading package lists...

Building dependency tree...

Reading state information...

apt-utils is already the newest version.

The following NEW packages will be installed:

fakeroot libfakeroot

0 upgraded, 2 newly installed, 0 to remove and 0 not upgraded.

Need to get 0 B/129 kB of archives.

After this operation, 434 kB of additional disk space will be used.

E: Can not write log (Is /dev/pts mounted?) - posix_openpt (2: No such file or directory)

Selecting previously unselected package libfakeroot:amd64.

(Reading database ... 17082 files and directories currently installed.)

Preparing to unpack .../libfakeroot_1.20.2-1_amd64.deb ...

Unpacking libfakeroot:amd64 (1.20.2-1) ...

Selecting previously unselected package fakeroot.

Preparing to unpack .../fakeroot_1.20.2-1_amd64.deb ...

Unpacking fakeroot (1.20.2-1) ...

Processing triggers for man-db (2.7.0.2-5) ...

Not building database; man-db/auto-update is not &#39;true&#39;.

Setting up libfakeroot:amd64 (1.20.2-1) ...

Setting up fakeroot (1.20.2-1) ...

update-alternatives: using /usr/bin/fakeroot-sysv to provide /usr/bin/fakeroot (fakeroot) in auto mode

[0mI: Copying back the cached apt archive contents [0m

[0mI: Copying source file [0m

[0mI: copying [/tmp/tmpjIFROk/logilab-common_1.3.0-1~revf3ab15166db9.dsc] [0m

[0mI: copying [/tmp/tmpjIFROk/logilab-common_1.3.0.orig.tar.gz] [0m

[0mI: copying [/tmp/tmpjIFROk/logilab-common_1.3.0-1~revf3ab15166db9.diff.gz] [0m

[0mI: Extracting source [0m

dpkg-source: warning: extracting unsigned source package (logilab-common_1.3.0-1~revf3ab15166db9.dsc)

dpkg-source: info: extracting logilab-common in logilab-common-1.3.0

dpkg-source: info: unpacking logilab-common_1.3.0.orig.tar.gz

dpkg-source: info: applying logilab-common_1.3.0-1~revf3ab15166db9.diff.gz

[0mI: Building the package [0m

[0mI: Running cd /build/*/ &amp;&amp; env PATH=&quot;/usr/sbin:/usr/bin:/sbin:/bin&quot; HOME=&quot;/nonexistent&quot; dpkg-buildpackage -us -uc -rfakeroot [0m

dpkg-buildpackage: source package logilab-common

dpkg-buildpackage: source version 1.3.0-1~revf3ab15166db9

dpkg-buildpackage: source distribution jessie

dpkg-buildpackage: source changed by Denis Laxalde &lt;denis.laxalde@logilab.fr&gt;

dpkg-source --before-build logilab-common-1.3.0

dpkg-buildpackage: host architecture amd64

fakeroot debian/rules clean

dh clean --with python2,python3

dh_testdir

dh_auto_clean

running clean

&#39;build/lib.linux-x86_64-2.7&#39; does not exist -- can&#39;t clean it

&#39;build/bdist.linux-x86_64&#39; does not exist -- can&#39;t clean it

&#39;build/scripts-2.7&#39; does not exist -- can&#39;t clean it

debian/rules override_dh_clean

make[1]: Entering directory &#39;/build/logilab-common-1.3.0&#39;

dh_clean

rm -rf doc/apidoc

rm -rf logilab_common.egg-info

make[1]: Leaving directory &#39;/build/logilab-common-1.3.0&#39;

dpkg-source -b logilab-common-1.3.0

dpkg-source: info: using source format `1.0&#39;

dpkg-source: info: building logilab-common using existing logilab-common_1.3.0.orig.tar.gz

dpkg-source: info: building logilab-common in logilab-common_1.3.0-1~revf3ab15166db9.diff.gz

dpkg-source: warning: ignoring deletion of directory logilab_common.egg-info

dpkg-source: warning: ignoring deletion of file logilab_common.egg-info/top_level.txt, use --include-removal to override

dpkg-source: warning: ignoring deletion of file logilab_common.egg-info/SOURCES.txt, use --include-removal to override

dpkg-source: warning: ignoring deletion of file logilab_common.egg-info/dependency_links.txt, use --include-removal to override

dpkg-source: warning: ignoring deletion of file logilab_common.egg-info/PKG-INFO, use --include-removal to override

dpkg-source: warning: ignoring deletion of file logilab_common.egg-info/requires.txt, use --include-removal to override

dpkg-source: warning: ignoring deletion of file logilab_common.egg-info/namespace_packages.txt, use --include-removal to override

dpkg-source: info: building logilab-common in logilab-common_1.3.0-1~revf3ab15166db9.dsc

debian/rules build

dh build-indep --with python2,python3

dh_testdir -i

dh_auto_configure -i

debian/rules override_dh_auto_build

make[1]: Entering directory &#39;/build/logilab-common-1.3.0&#39;

dh_auto_build

running build

running build_py

creating build

creating build/lib.linux-x86_64-2.7

creating build/lib.linux-x86_64-2.7/logilab

copying logilab/__init__.py -&gt; build/lib.linux-x86_64-2.7/logilab

creating build/lib.linux-x86_64-2.7/logilab/common

copying logilab/common/sphinxutils.py -&gt; build/lib.linux-x86_64-2.7/logilab/common

copying logilab/common/tasksqueue.py -&gt; build/lib.linux-x86_64-2.7/logilab/common

copying logilab/common/changelog.py -&gt; build/lib.linux-x86_64-2.7/logilab/common

copying logilab/common/debugger.py -&gt; build/lib.linux-x86_64-2.7/logilab/common

copying logilab/common/cache.py -&gt; build/lib.linux-x86_64-2.7/logilab/common

copying logilab/common/fileutils.py -&gt; build/lib.linux-x86_64-2.7/logilab/common

copying logilab/common/modutils.py -&gt; build/lib.linux-x86_64-2.7/logilab/common

copying logilab/common/pytest.py -&gt; build/lib.linux-x86_64-2.7/logilab/common

copying logilab/common/visitor.py -&gt; build/lib.linux-x86_64-2.7/logilab/common

copying logilab/common/graph.py -&gt; build/lib.linux-x86_64-2.7/logilab/common

copying logilab/common/vcgutils.py -&gt; build/lib.linux-x86_64-2.7/logilab/common

copying logilab/common/tree.py -&gt; build/lib.linux-x86_64-2.7/logilab/common

copying logilab/common/textutils.py -&gt; build/lib.linux-x86_64-2.7/logilab/common

copying logilab/common/compat.py -&gt; build/lib.linux-x86_64-2.7/logilab/common

copying logilab/common/registry.py -&gt; build/lib.linux-x86_64-2.7/logilab/common

copying logilab/common/date.py -&gt; build/lib.linux-x86_64-2.7/logilab/common

copying logilab/common/xmlutils.py -&gt; build/lib.linux-x86_64-2.7/logilab/common

copying logilab/common/sphinx_ext.py -&gt; build/lib.linux-x86_64-2.7/logilab/common

copying logilab/common/urllib2ext.py -&gt; build/lib.linux-x86_64-2.7/logilab/common

copying logilab/common/table.py -&gt; build/lib.linux-x86_64-2.7/logilab/common

copying logilab/common/testlib.py -&gt; build/lib.linux-x86_64-2.7/logilab/common

copying logilab/common/proc.py -&gt; build/lib.linux-x86_64-2.7/logilab/common

copying logilab/common/clcommands.py -&gt; build/lib.linux-x86_64-2.7/logilab/common

copying logilab/common/logging_ext.py -&gt; build/lib.linux-x86_64-2.7/logilab/common

copying logilab/common/__init__.py -&gt; build/lib.linux-x86_64-2.7/logilab/common

copying logilab/common/decorators.py -&gt; build/lib.linux-x86_64-2.7/logilab/common

copying logilab/common/daemon.py -&gt; build/lib.linux-x86_64-2.7/logilab/common

copying logilab/common/shellutils.py -&gt; build/lib.linux-x86_64-2.7/logilab/common

copying logilab/common/configuration.py -&gt; build/lib.linux-x86_64-2.7/logilab/common

copying logilab/common/optparser.py -&gt; build/lib.linux-x86_64-2.7/logilab/common

copying logilab/common/deprecation.py -&gt; build/lib.linux-x86_64-2.7/logilab/common

copying logilab/common/optik_ext.py -&gt; build/lib.linux-x86_64-2.7/logilab/common

copying logilab/common/umessage.py -&gt; build/lib.linux-x86_64-2.7/logilab/common

copying logilab/common/interface.py -&gt; build/lib.linux-x86_64-2.7/logilab/common

creating build/lib.linux-x86_64-2.7/logilab/common/ureports

copying logilab/common/ureports/html_writer.py -&gt; build/lib.linux-x86_64-2.7/logilab/common/ureports

copying logilab/common/ureports/nodes.py -&gt; build/lib.linux-x86_64-2.7/logilab/common/ureports

copying logilab/common/ureports/docbook_writer.py -&gt; build/lib.linux-x86_64-2.7/logilab/common/ureports

copying logilab/common/ureports/__init__.py -&gt; build/lib.linux-x86_64-2.7/logilab/common/ureports

copying logilab/common/ureports/text_writer.py -&gt; build/lib.linux-x86_64-2.7/logilab/common/ureports

running build_scripts

creating build/scripts-2.7

copying and adjusting bin/logilab-pytest -&gt; build/scripts-2.7

changing mode of build/scripts-2.7/logilab-pytest from 644 to 755

python setup.py build --build-purelib build/lib

running build

running build_py

creating build/lib

creating build/lib/logilab

copying logilab/__init__.py -&gt; build/lib/logilab

creating build/lib/logilab/common

copying logilab/common/sphinxutils.py -&gt; build/lib/logilab/common

copying logilab/common/tasksqueue.py -&gt; build/lib/logilab/common

copying logilab/common/changelog.py -&gt; build/lib/logilab/common

copying logilab/common/debugger.py -&gt; build/lib/logilab/common

copying logilab/common/cache.py -&gt; build/lib/logilab/common

copying logilab/common/fileutils.py -&gt; build/lib/logilab/common

copying logilab/common/modutils.py -&gt; build/lib/logilab/common

copying logilab/common/pytest.py -&gt; build/lib/logilab/common

copying logilab/common/visitor.py -&gt; build/lib/logilab/common

copying logilab/common/graph.py -&gt; build/lib/logilab/common

copying logilab/common/vcgutils.py -&gt; build/lib/logilab/common

copying logilab/common/tree.py -&gt; build/lib/logilab/common

copying logilab/common/textutils.py -&gt; build/lib/logilab/common

copying logilab/common/compat.py -&gt; build/lib/logilab/common

copying logilab/common/registry.py -&gt; build/lib/logilab/common

copying logilab/common/date.py -&gt; build/lib/logilab/common

copying logilab/common/xmlutils.py -&gt; build/lib/logilab/common

copying logilab/common/sphinx_ext.py -&gt; build/lib/logilab/common

copying logilab/common/urllib2ext.py -&gt; build/lib/logilab/common

copying logilab/common/table.py -&gt; build/lib/logilab/common

copying logilab/common/testlib.py -&gt; build/lib/logilab/common

copying logilab/common/proc.py -&gt; build/lib/logilab/common

copying logilab/common/clcommands.py -&gt; build/lib/logilab/common

copying logilab/common/logging_ext.py -&gt; build/lib/logilab/common

copying logilab/common/__init__.py -&gt; build/lib/logilab/common

copying logilab/common/decorators.py -&gt; build/lib/logilab/common

copying logilab/common/daemon.py -&gt; build/lib/logilab/common

copying logilab/common/shellutils.py -&gt; build/lib/logilab/common

copying logilab/common/configuration.py -&gt; build/lib/logilab/common

copying logilab/common/optparser.py -&gt; build/lib/logilab/common

copying logilab/common/deprecation.py -&gt; build/lib/logilab/common

copying logilab/common/optik_ext.py -&gt; build/lib/logilab/common

copying logilab/common/umessage.py -&gt; build/lib/logilab/common

copying logilab/common/interface.py -&gt; build/lib/logilab/common

creating build/lib/logilab/common/ureports

copying logilab/common/ureports/html_writer.py -&gt; build/lib/logilab/common/ureports

copying logilab/common/ureports/nodes.py -&gt; build/lib/logilab/common/ureports

copying logilab/common/ureports/docbook_writer.py -&gt; build/lib/logilab/common/ureports

copying logilab/common/ureports/__init__.py -&gt; build/lib/logilab/common/ureports

copying logilab/common/ureports/text_writer.py -&gt; build/lib/logilab/common/ureports

running build_scripts

/usr/bin/make -C doc

make[2]: Entering directory &#39;/build/logilab-common-1.3.0/doc&#39;

mkdir -p apidoc

epydoc --parse-only -o apidoc --html -v --no-private --exclude=&#39;test&#39; --exclude=&quot;__pkginfo__&quot; --exclude=&quot;setup&quot; -n &quot;Logilab&#39;s common library&quot; /build/logilab-common-1.3.0/build/lib/logilab/common &gt;/dev/null

make[2]: Leaving directory &#39;/build/logilab-common-1.3.0/doc&#39;

make[1]: Leaving directory &#39;/build/logilab-common-1.3.0&#39;

debian/rules override_dh_auto_test

make[1]: Entering directory &#39;/build/logilab-common-1.3.0&#39;

python setup.py install \

--root=/build/logilab-common-1.3.0/testing/ --install-layout=deb

running install

running build

running build_py

running build_scripts

running install_lib

Skipping installation of /build/logilab-common-1.3.0/testing/usr/lib/python2.7/dist-packages/logilab/__init__.py (namespace package)

copying logilab/common/sphinxutils.py -&gt; /build/logilab-common-1.3.0/testing/usr/lib/python2.7/dist-packages/logilab/common

copying logilab/common/tasksqueue.py -&gt; /build/logilab-common-1.3.0/testing/usr/lib/python2.7/dist-packages/logilab/common

copying logilab/common/changelog.py -&gt; /build/logilab-common-1.3.0/testing/usr/lib/python2.7/dist-packages/logilab/common

copying logilab/common/debugger.py -&gt; /build/logilab-common-1.3.0/testing/usr/lib/python2.7/dist-packages/logilab/common

copying logilab/common/cache.py -&gt; /build/logilab-common-1.3.0/testing/usr/lib/python2.7/dist-packages/logilab/common

copying logilab/common/fileutils.py -&gt; /build/logilab-common-1.3.0/testing/usr/lib/python2.7/dist-packages/logilab/common

copying logilab/common/modutils.py -&gt; /build/logilab-common-1.3.0/testing/usr/lib/python2.7/dist-packages/logilab/common

copying logilab/common/pytest.py -&gt; /build/logilab-common-1.3.0/testing/usr/lib/python2.7/dist-packages/logilab/common

copying logilab/common/visitor.py -&gt; /build/logilab-common-1.3.0/testing/usr/lib/python2.7/dist-packages/logilab/common

copying logilab/common/graph.py -&gt; /build/logilab-common-1.3.0/testing/usr/lib/python2.7/dist-packages/logilab/common

copying logilab/common/vcgutils.py -&gt; /build/logilab-common-1.3.0/testing/usr/lib/python2.7/dist-packages/logilab/common

copying logilab/common/tree.py -&gt; /build/logilab-common-1.3.0/testing/usr/lib/python2.7/dist-packages/logilab/common

copying logilab/common/textutils.py -&gt; /build/logilab-common-1.3.0/testing/usr/lib/python2.7/dist-packages/logilab/common

copying logilab/common/compat.py -&gt; /build/logilab-common-1.3.0/testing/usr/lib/python2.7/dist-packages/logilab/common

copying logilab/common/registry.py -&gt; /build/logilab-common-1.3.0/testing/usr/lib/python2.7/dist-packages/logilab/common

copying logilab/common/date.py -&gt; /build/logilab-common-1.3.0/testing/usr/lib/python2.7/dist-packages/logilab/common

copying logilab/common/xmlutils.py -&gt; /build/logilab-common-1.3.0/testing/usr/lib/python2.7/dist-packages/logilab/common

copying logilab/common/sphinx_ext.py -&gt; /build/logilab-common-1.3.0/testing/usr/lib/python2.7/dist-packages/logilab/common

copying logilab/common/urllib2ext.py -&gt; /build/logilab-common-1.3.0/testing/usr/lib/python2.7/dist-packages/logilab/common

copying logilab/common/table.py -&gt; /build/logilab-common-1.3.0/testing/usr/lib/python2.7/dist-packages/logilab/common

copying logilab/common/testlib.py -&gt; /build/logilab-common-1.3.0/testing/usr/lib/python2.7/dist-packages/logilab/common

copying logilab/common/proc.py -&gt; /build/logilab-common-1.3.0/testing/usr/lib/python2.7/dist-packages/logilab/common

copying logilab/common/clcommands.py -&gt; /build/logilab-common-1.3.0/testing/usr/lib/python2.7/dist-packages/logilab/common

copying logilab/common/logging_ext.py -&gt; /build/logilab-common-1.3.0/testing/usr/lib/python2.7/dist-packages/logilab/common

copying logilab/common/__init__.py -&gt; /build/logilab-common-1.3.0/testing/usr/lib/python2.7/dist-packages/logilab/common

copying logilab/common/decorators.py -&gt; /build/logilab-common-1.3.0/testing/usr/lib/python2.7/dist-packages/logilab/common

copying logilab/common/daemon.py -&gt; /build/logilab-common-1.3.0/testing/usr/lib/python2.7/dist-packages/logilab/common

copying logilab/common/shellutils.py -&gt; /build/logilab-common-1.3.0/testing/usr/lib/python2.7/dist-packages/logilab/common

copying logilab/common/configuration.py -&gt; /build/logilab-common-1.3.0/testing/usr/lib/python2.7/dist-packages/logilab/common

copying logilab/common/optparser.py -&gt; /build/logilab-common-1.3.0/testing/usr/lib/python2.7/dist-packages/logilab/common

copying logilab/common/deprecation.py -&gt; /build/logilab-common-1.3.0/testing/usr/lib/python2.7/dist-packages/logilab/common

copying logilab/common/optik_ext.py -&gt; /build/logilab-common-1.3.0/testing/usr/lib/python2.7/dist-packages/logilab/common

copying logilab/common/umessage.py -&gt; /build/logilab-common-1.3.0/testing/usr/lib/python2.7/dist-packages/logilab/common

copying logilab/common/interface.py -&gt; /build/logilab-common-1.3.0/testing/usr/lib/python2.7/dist-packages/logilab/common

copying logilab/common/ureports/html_writer.py -&gt; /build/logilab-common-1.3.0/testing/usr/lib/python2.7/dist-packages/logilab/common/ureports

copying logilab/common/ureports/nodes.py -&gt; /build/logilab-common-1.3.0/testing/usr/lib/python2.7/dist-packages/logilab/common/ureports

copying logilab/common/ureports/docbook_writer.py -&gt; /build/logilab-common-1.3.0/testing/usr/lib/python2.7/dist-packages/logilab/common/ureports

copying logilab/common/ureports/__init__.py -&gt; /build/logilab-common-1.3.0/testing/usr/lib/python2.7/dist-packages/logilab/common/ureports

copying logilab/common/ureports/text_writer.py -&gt; /build/logilab-common-1.3.0/testing/usr/lib/python2.7/dist-packages/logilab/common/ureports

byte-compiling /build/logilab-common-1.3.0/testing/usr/lib/python2.7/dist-packages/logilab/common/sphinxutils.py to sphinxutils.pyc

byte-compiling /build/logilab-common-1.3.0/testing/usr/lib/python2.7/dist-packages/logilab/common/tasksqueue.py to tasksqueue.pyc

byte-compiling /build/logilab-common-1.3.0/testing/usr/lib/python2.7/dist-packages/logilab/common/changelog.py to changelog.pyc

byte-compiling /build/logilab-common-1.3.0/testing/usr/lib/python2.7/dist-packages/logilab/common/debugger.py to debugger.pyc

byte-compiling /build/logilab-common-1.3.0/testing/usr/lib/python2.7/dist-packages/logilab/common/cache.py to cache.pyc

byte-compiling /build/logilab-common-1.3.0/testing/usr/lib/python2.7/dist-packages/logilab/common/fileutils.py to fileutils.pyc

byte-compiling /build/logilab-common-1.3.0/testing/usr/lib/python2.7/dist-packages/logilab/common/modutils.py to modutils.pyc

byte-compiling /build/logilab-common-1.3.0/testing/usr/lib/python2.7/dist-packages/logilab/common/pytest.py to pytest.pyc

byte-compiling /build/logilab-common-1.3.0/testing/usr/lib/python2.7/dist-packages/logilab/common/visitor.py to visitor.pyc

byte-compiling /build/logilab-common-1.3.0/testing/usr/lib/python2.7/dist-packages/logilab/common/graph.py to graph.pyc

byte-compiling /build/logilab-common-1.3.0/testing/usr/lib/python2.7/dist-packages/logilab/common/vcgutils.py to vcgutils.pyc

byte-compiling /build/logilab-common-1.3.0/testing/usr/lib/python2.7/dist-packages/logilab/common/tree.py to tree.pyc

byte-compiling /build/logilab-common-1.3.0/testing/usr/lib/python2.7/dist-packages/logilab/common/textutils.py to textutils.pyc

byte-compiling /build/logilab-common-1.3.0/testing/usr/lib/python2.7/dist-packages/logilab/common/compat.py to compat.pyc

byte-compiling /build/logilab-common-1.3.0/testing/usr/lib/python2.7/dist-packages/logilab/common/registry.py to registry.pyc

byte-compiling /build/logilab-common-1.3.0/testing/usr/lib/python2.7/dist-packages/logilab/common/date.py to date.pyc

byte-compiling /build/logilab-common-1.3.0/testing/usr/lib/python2.7/dist-packages/logilab/common/xmlutils.py to xmlutils.pyc

byte-compiling /build/logilab-common-1.3.0/testing/usr/lib/python2.7/dist-packages/logilab/common/sphinx_ext.py to sphinx_ext.pyc

byte-compiling /build/logilab-common-1.3.0/testing/usr/lib/python2.7/dist-packages/logilab/common/urllib2ext.py to urllib2ext.pyc

byte-compiling /build/logilab-common-1.3.0/testing/usr/lib/python2.7/dist-packages/logilab/common/table.py to table.pyc

byte-compiling /build/logilab-common-1.3.0/testing/usr/lib/python2.7/dist-packages/logilab/common/testlib.py to testlib.pyc

byte-compiling /build/logilab-common-1.3.0/testing/usr/lib/python2.7/dist-packages/logilab/common/proc.py to proc.pyc

byte-compiling /build/logilab-common-1.3.0/testing/usr/lib/python2.7/dist-packages/logilab/common/clcommands.py to clcommands.pyc

byte-compiling /build/logilab-common-1.3.0/testing/usr/lib/python2.7/dist-packages/logilab/common/logging_ext.py to logging_ext.pyc

byte-compiling /build/logilab-common-1.3.0/testing/usr/lib/python2.7/dist-packages/logilab/common/__init__.py to __init__.pyc

byte-compiling /build/logilab-common-1.3.0/testing/usr/lib/python2.7/dist-packages/logilab/common/decorators.py to decorators.pyc

byte-compiling /build/logilab-common-1.3.0/testing/usr/lib/python2.7/dist-packages/logilab/common/daemon.py to daemon.pyc

byte-compiling /build/logilab-common-1.3.0/testing/usr/lib/python2.7/dist-packages/logilab/common/shellutils.py to shellutils.pyc

byte-compiling /build/logilab-common-1.3.0/testing/usr/lib/python2.7/dist-packages/logilab/common/configuration.py to configuration.pyc

byte-compiling /build/logilab-common-1.3.0/testing/usr/lib/python2.7/dist-packages/logilab/common/optparser.py to optparser.pyc

byte-compiling /build/logilab-common-1.3.0/testing/usr/lib/python2.7/dist-packages/logilab/common/deprecation.py to deprecation.pyc

byte-compiling /build/logilab-common-1.3.0/testing/usr/lib/python2.7/dist-packages/logilab/common/optik_ext.py to optik_ext.pyc

byte-compiling /build/logilab-common-1.3.0/testing/usr/lib/python2.7/dist-packages/logilab/common/umessage.py to umessage.pyc

byte-compiling /build/logilab-common-1.3.0/testing/usr/lib/python2.7/dist-packages/logilab/common/interface.py to interface.pyc

byte-compiling /build/logilab-common-1.3.0/testing/usr/lib/python2.7/dist-packages/logilab/common/ureports/html_writer.py to html_writer.pyc

byte-compiling /build/logilab-common-1.3.0/testing/usr/lib/python2.7/dist-packages/logilab/common/ureports/nodes.py to nodes.pyc

byte-compiling /build/logilab-common-1.3.0/testing/usr/lib/python2.7/dist-packages/logilab/common/ureports/docbook_writer.py to docbook_writer.pyc

byte-compiling /build/logilab-common-1.3.0/testing/usr/lib/python2.7/dist-packages/logilab/common/ureports/__init__.py to __init__.pyc

byte-compiling /build/logilab-common-1.3.0/testing/usr/lib/python2.7/dist-packages/logilab/common/ureports/text_writer.py to text_writer.pyc

running install_egg_info

running egg_info

creating logilab_common.egg-info

writing requirements to logilab_common.egg-info/requires.txt

writing logilab_common.egg-info/PKG-INFO

writing namespace_packages to logilab_common.egg-info/namespace_packages.txt

writing top-level names to logilab_common.egg-info/top_level.txt

writing dependency_links to logilab_common.egg-info/dependency_links.txt

writing manifest file &#39;logilab_common.egg-info/SOURCES.txt&#39;

reading manifest file &#39;logilab_common.egg-info/SOURCES.txt&#39;

reading manifest template &#39;MANIFEST.in&#39;

warning: no files found matching &#39;*.py&#39; under directory &#39;test/input&#39;

warning: no files found matching &#39;*&#39; under directory &#39;doc/html&#39;

writing manifest file &#39;logilab_common.egg-info/SOURCES.txt&#39;

Copying logilab_common.egg-info to /build/logilab-common-1.3.0/testing/usr/lib/python2.7/dist-packages/logilab_common-1.3.0.egg-info

Installing /build/logilab-common-1.3.0/testing/usr/lib/python2.7/dist-packages/logilab_common-1.3.0-nspkg.pth

running install_scripts

creating /build/logilab-common-1.3.0/testing/usr/bin

copying build/scripts-2.7/logilab-pytest -&gt; /build/logilab-common-1.3.0/testing/usr/bin

changing mode of /build/logilab-common-1.3.0/testing/usr/bin/logilab-pytest to 755

echo &#39;import site, os.path; site.addsitedir(os.path.dirname(__file__))&#39; &gt; testing//usr/lib/python2.7/dist-packages/sitecustomize.py

PYTHONPATH=/build/logilab-common-1.3.0/testing//usr/lib/python2.7/dist-packages python -m logilab.common.pytest -t /build/logilab-common-1.3.0/test

==================== unittest_configuration.py =====================

..................

======================= unittest_umessage.py =======================

.......

======================= unittest_registry.py =======================

............

====================== unittest_taskqueue.py =======================

.....

======================== unittest_table.py =========================

.....................................

========================= unittest_date.py =========================

......................................................

======================== unittest_graph.py =========================

..............

========================= unittest_tree.py =========================

........................

==================== unittest_ureports_html.py =====================

.......

====================== unittest_textutils.py =======================

.........................................

======================== unittest_cache.py =========================

........

====================== unittest_interface.py =======================

.....

====================== unittest_decorators.py ======================

.............

======================== unittest_pytest.py ========================

.....

====================== unittest_changelog.py =======================

.

===================== unittest_deprecation.py ======================

.......

====================== unittest_shellutils.py ======================

..................

======================= unittest_modutils.py =======================

....................................

==================== unittest_ureports_text.py =====================

.......

======================= unittest_xmlutils.py =======================

.....

======================= unittest_testlib.py ========================

...........................................................................................

====================== unittest_fileutils.py =======================

............

*******************************************************************************

Ran 427 test cases in 0.19s (0.18s CPU)

All 22 modules OK

Traceback (most recent call last):

File &quot;/usr/lib/python2.7/runpy.py&quot;, line 162, in _run_module_as_main

&quot;__main__&quot;, fname, loader, pkg_name)

File &quot;/usr/lib/python2.7/runpy.py&quot;, line 72, in _run_code

exec code in run_globals

File &quot;/build/logilab-common-1.3.0/testing/usr/lib/python2.7/dist-packages/logilab/common/pytest.py&quot;, line 1303, in &lt;module&gt;

run()

File &quot;/build/logilab-common-1.3.0/testing/usr/lib/python2.7/dist-packages/logilab/common/deprecation.py&quot;, line 84, in wrapped

return func(*args, **kwargs)

File &quot;/build/logilab-common-1.3.0/testing/usr/lib/python2.7/dist-packages/logilab/common/pytest.py&quot;, line 672, in run

sys.exit(tester.errcode)

AttributeError: &#39;NoneType&#39; object has no attribute &#39;exit&#39;

debian/rules:69: recipe for target &#39;override_dh_auto_test&#39; failed

make[1]: *** [override_dh_auto_test] Error 1

make[1]: Leaving directory &#39;/build/logilab-common-1.3.0&#39;

debian/rules:30: recipe for target &#39;build-indep&#39; failed

make: *** [build-indep] Error 2

dpkg-buildpackage: error: debian/rules build gave error exit status 2

[0mI: copying local configuration [0m

[0;31mE: Failed autobuilding of package [0m

[0mI: user script /var/cache/pbuilder/build/5204/tmp/hooks/C10shell starting [0m

If you want to enter into the chroot image to debug, you have to edit your ~/.pbuilderrc with:

export LGP_AUTO_ENTER_SHELL=y

[0mI: user script /var/cache/pbuilder/build/5204/tmp/hooks/C10shell finished [0m

[0mI: unmounting /sys filesystem [0m

[0mI: unmounting /dev filesystem [0m

[0mI: unmounting dev/pts filesystem [0m

[0mI: unmounting run/shm filesystem [0m

[0mI: unmounting proc filesystem [0m

[0mI: unmounting sys filesystem [0m

[0mI: cleaning the build env [0m

[0mI: removing directory /var/cache/pbuilder/build/5204 and its subdirectories [0m
<br/>20 printing /tmp/tmp3xvLni/common/../epel-7-x86_64/build.log: Mock Version: 1.1.33

ENTER do([&#39;bash&#39;, &#39;--login&#39;, &#39;-c&#39;, &#39;rpmbuild -bs --target x86_64 --nodeps builddir/build/SPECS/python-logilab-common.spec&#39;], False, &#39;/var/lib/mock/epel-7-x86_64-4888/root/&#39;, None, 0, True, False, 111, 122, None, False, {&#39;LANG&#39;: &#39;en_US.UTF-8&#39;, &#39;TERM&#39;: &#39;vt100&#39;, &#39;SHELL&#39;: &#39;/bin/bash&#39;, &#39;CCACHE_DIR&#39;: &#39;/tmp/ccache&#39;, &#39;HOSTNAME&#39;: &#39;mock&#39;, &#39;PROMPT_COMMAND&#39;: &#39;echo -n &quot;&lt;mock-chroot&gt;&quot;&#39;, &#39;HOME&#39;: &#39;/builddir&#39;, &#39;PATH&#39;: &#39;/usr/bin:/bin:/usr/sbin:/sbin&#39;, &#39;CCACHE_UMASK&#39;: &#39;002&#39;}, logger=&lt;mockbuild.trace_decorator.getLog object at 0x7f319a401fd0&gt;)

Executing command: [&#39;bash&#39;, &#39;--login&#39;, &#39;-c&#39;, &#39;rpmbuild -bs --target x86_64 --nodeps builddir/build/SPECS/python-logilab-common.spec&#39;] with env {&#39;LANG&#39;: &#39;en_US.UTF-8&#39;, &#39;TERM&#39;: &#39;vt100&#39;, &#39;SHELL&#39;: &#39;/bin/bash&#39;, &#39;CCACHE_DIR&#39;: &#39;/tmp/ccache&#39;, &#39;HOSTNAME&#39;: &#39;mock&#39;, &#39;PROMPT_COMMAND&#39;: &#39;echo -n &quot;&lt;mock-chroot&gt;&quot;&#39;, &#39;HOME&#39;: &#39;/builddir&#39;, &#39;PATH&#39;: &#39;/usr/bin:/bin:/usr/sbin:/sbin&#39;, &#39;CCACHE_UMASK&#39;: &#39;002&#39;}

sh: /usr/bin/python: No such file or directory

sh: /usr/bin/python: No such file or directory

Building target platforms: x86_64

Building for target x86_64

Wrote: /builddir/build/SRPMS/python-logilab-common-1.3.0-logilab.1.el7.centos~revf3ab15166db9.src.rpm

Child return code was: 0

LEAVE do --&gt;

Mock Version: 1.1.33

ENTER do([&#39;bash&#39;, &#39;--login&#39;, &#39;-c&#39;, &#39;rpmbuild -bs --target x86_64 --nodeps builddir/build/SPECS/python-logilab-common.spec&#39;], False, &#39;/var/lib/mock/epel-7-x86_64-4888/root/&#39;, None, 0, True, False, 111, 122, None, False, {&#39;LANG&#39;: &#39;en_US.UTF-8&#39;, &#39;TERM&#39;: &#39;vt100&#39;, &#39;SHELL&#39;: &#39;/bin/bash&#39;, &#39;CCACHE_DIR&#39;: &#39;/tmp/ccache&#39;, &#39;HOSTNAME&#39;: &#39;mock&#39;, &#39;PROMPT_COMMAND&#39;: &#39;echo -n &quot;&lt;mock-chroot&gt;&quot;&#39;, &#39;HOME&#39;: &#39;/builddir&#39;, &#39;PATH&#39;: &#39;/usr/bin:/bin:/usr/sbin:/sbin&#39;, &#39;CCACHE_UMASK&#39;: &#39;002&#39;}, logger=&lt;mockbuild.trace_decorator.getLog object at 0x7f0180100f90&gt;)

Executing command: [&#39;bash&#39;, &#39;--login&#39;, &#39;-c&#39;, &#39;rpmbuild -bs --target x86_64 --nodeps builddir/build/SPECS/python-logilab-common.spec&#39;] with env {&#39;LANG&#39;: &#39;en_US.UTF-8&#39;, &#39;TERM&#39;: &#39;vt100&#39;, &#39;SHELL&#39;: &#39;/bin/bash&#39;, &#39;CCACHE_DIR&#39;: &#39;/tmp/ccache&#39;, &#39;HOSTNAME&#39;: &#39;mock&#39;, &#39;PROMPT_COMMAND&#39;: &#39;echo -n &quot;&lt;mock-chroot&gt;&quot;&#39;, &#39;HOME&#39;: &#39;/builddir&#39;, &#39;PATH&#39;: &#39;/usr/bin:/bin:/usr/sbin:/sbin&#39;, &#39;CCACHE_UMASK&#39;: &#39;002&#39;}

sh: /usr/bin/python: No such file or directory

sh: /usr/bin/python: No such file or directory

Building target platforms: x86_64

Building for target x86_64

Wrote: /builddir/build/SRPMS/python-logilab-common-1.3.0-logilab.1.el7.centos~revf3ab15166db9.src.rpm

Child return code was: 0

LEAVE do --&gt;

ENTER do([&#39;bash&#39;, &#39;--login&#39;, &#39;-c&#39;, &#39;rpmbuild -bb --target x86_64 --nodeps builddir/build/SPECS/python-logilab-common.spec&#39;], False, &#39;/var/lib/mock/epel-7-x86_64-4888/root/&#39;, None, 0, True, False, 111, 122, None, False, {&#39;LANG&#39;: &#39;en_US.UTF-8&#39;, &#39;TERM&#39;: &#39;vt100&#39;, &#39;SHELL&#39;: &#39;/bin/bash&#39;, &#39;CCACHE_DIR&#39;: &#39;/tmp/ccache&#39;, &#39;HOSTNAME&#39;: &#39;mock&#39;, &#39;PROMPT_COMMAND&#39;: &#39;echo -n &quot;&lt;mock-chroot&gt;&quot;&#39;, &#39;HOME&#39;: &#39;/builddir&#39;, &#39;PATH&#39;: &#39;/usr/bin:/bin:/usr/sbin:/sbin&#39;, &#39;CCACHE_UMASK&#39;: &#39;002&#39;}, logger=&lt;mockbuild.trace_decorator.getLog object at 0x7f0180100f90&gt;)

Executing command: [&#39;bash&#39;, &#39;--login&#39;, &#39;-c&#39;, &#39;rpmbuild -bb --target x86_64 --nodeps builddir/build/SPECS/python-logilab-common.spec&#39;] with env {&#39;LANG&#39;: &#39;en_US.UTF-8&#39;, &#39;TERM&#39;: &#39;vt100&#39;, &#39;SHELL&#39;: &#39;/bin/bash&#39;, &#39;CCACHE_DIR&#39;: &#39;/tmp/ccache&#39;, &#39;HOSTNAME&#39;: &#39;mock&#39;, &#39;PROMPT_COMMAND&#39;: &#39;echo -n &quot;&lt;mock-chroot&gt;&quot;&#39;, &#39;HOME&#39;: &#39;/builddir&#39;, &#39;PATH&#39;: &#39;/usr/bin:/bin:/usr/sbin:/sbin&#39;, &#39;CCACHE_UMASK&#39;: &#39;002&#39;}

Building target platforms: x86_64

Building for target x86_64

Executing(%prep): /bin/sh -e /var/tmp/rpm-tmp.TULePH

+ umask 022

+ cd /builddir/build/BUILD

+ cd /builddir/build/BUILD

+ rm -rf logilab-common-1.3.0

+ /usr/bin/gzip -dc /builddir/build/SOURCES/logilab-common-1.3.0.tar.gz

+ /usr/bin/tar -xf -

+ STATUS=0

+ &#39;[&#39; 0 -ne 0 &#39;]&#39;

+ cd logilab-common-1.3.0

+ /usr/bin/chmod -Rf a+rX,u+w,g-w,o-w .

+ exit 0

Executing(%build): /bin/sh -e /var/tmp/rpm-tmp.ULfeYM

+ umask 022

+ cd /builddir/build/BUILD

+ cd logilab-common-1.3.0

+ /usr/bin/python setup.py build

running build

running build_py

creating build

creating build/lib

creating build/lib/logilab

copying logilab/__init__.py -&gt; build/lib/logilab

creating build/lib/logilab/common

copying logilab/common/sphinxutils.py -&gt; build/lib/logilab/common

copying logilab/common/tasksqueue.py -&gt; build/lib/logilab/common

copying logilab/common/changelog.py -&gt; build/lib/logilab/common

copying logilab/common/debugger.py -&gt; build/lib/logilab/common

copying logilab/common/cache.py -&gt; build/lib/logilab/common

copying logilab/common/fileutils.py -&gt; build/lib/logilab/common

copying logilab/common/modutils.py -&gt; build/lib/logilab/common

copying logilab/common/pytest.py -&gt; build/lib/logilab/common

copying logilab/common/visitor.py -&gt; build/lib/logilab/common

copying logilab/common/graph.py -&gt; build/lib/logilab/common

copying logilab/common/vcgutils.py -&gt; build/lib/logilab/common

copying logilab/common/tree.py -&gt; build/lib/logilab/common

copying logilab/common/textutils.py -&gt; build/lib/logilab/common

copying logilab/common/compat.py -&gt; build/lib/logilab/common

copying logilab/common/registry.py -&gt; build/lib/logilab/common

copying logilab/common/date.py -&gt; build/lib/logilab/common

copying logilab/common/xmlutils.py -&gt; build/lib/logilab/common

copying logilab/common/sphinx_ext.py -&gt; build/lib/logilab/common

copying logilab/common/urllib2ext.py -&gt; build/lib/logilab/common

copying logilab/common/table.py -&gt; build/lib/logilab/common

copying logilab/common/testlib.py -&gt; build/lib/logilab/common

copying logilab/common/proc.py -&gt; build/lib/logilab/common

copying logilab/common/clcommands.py -&gt; build/lib/logilab/common

copying logilab/common/logging_ext.py -&gt; build/lib/logilab/common

copying logilab/common/__init__.py -&gt; build/lib/logilab/common

copying logilab/common/decorators.py -&gt; build/lib/logilab/common

copying logilab/common/daemon.py -&gt; build/lib/logilab/common

copying logilab/common/shellutils.py -&gt; build/lib/logilab/common

copying logilab/common/configuration.py -&gt; build/lib/logilab/common

copying logilab/common/optparser.py -&gt; build/lib/logilab/common

copying logilab/common/deprecation.py -&gt; build/lib/logilab/common

copying logilab/common/optik_ext.py -&gt; build/lib/logilab/common

copying logilab/common/umessage.py -&gt; build/lib/logilab/common

copying logilab/common/interface.py -&gt; build/lib/logilab/common

creating build/lib/logilab/common/ureports

copying logilab/common/ureports/html_writer.py -&gt; build/lib/logilab/common/ureports

copying logilab/common/ureports/nodes.py -&gt; build/lib/logilab/common/ureports

copying logilab/common/ureports/docbook_writer.py -&gt; build/lib/logilab/common/ureports

copying logilab/common/ureports/__init__.py -&gt; build/lib/logilab/common/ureports

copying logilab/common/ureports/text_writer.py -&gt; build/lib/logilab/common/ureports

running build_scripts

creating build/scripts-2.7

copying and adjusting bin/logilab-pytest -&gt; build/scripts-2.7

changing mode of build/scripts-2.7/logilab-pytest from 644 to 755

+ exit 0

Executing(%install): /bin/sh -e /var/tmp/rpm-tmp.XwSJsS

+ umask 022

+ cd /builddir/build/BUILD

+ &#39;[&#39; /builddir/build/BUILDROOT/python-logilab-common-1.3.0-logilab.1.el7.centos~revf3ab15166db9.x86_64 &#39;!=&#39; / &#39;]&#39;

+ rm -rf /builddir/build/BUILDROOT/python-logilab-common-1.3.0-logilab.1.el7.centos~revf3ab15166db9.x86_64

++ dirname /builddir/build/BUILDROOT/python-logilab-common-1.3.0-logilab.1.el7.centos~revf3ab15166db9.x86_64

+ mkdir -p /builddir/build/BUILDROOT

+ mkdir /builddir/build/BUILDROOT/python-logilab-common-1.3.0-logilab.1.el7.centos~revf3ab15166db9.x86_64

+ cd logilab-common-1.3.0

+ rm -rf /builddir/build/BUILDROOT/python-logilab-common-1.3.0-logilab.1.el7.centos~revf3ab15166db9.x86_64

+ /usr/bin/python setup.py install -O1 --skip-build --root /builddir/build/BUILDROOT/python-logilab-common-1.3.0-logilab.1.el7.centos~revf3ab15166db9.x86_64

running install

running install_lib

Skipping installation of /builddir/build/BUILDROOT/python-logilab-common-1.3.0-logilab.1.el7.centos~revf3ab15166db9.x86_64/usr/lib/python2.7/site-packages/logilab/__init__.py (namespace package)

copying logilab/common/sphinxutils.py -&gt; /builddir/build/BUILDROOT/python-logilab-common-1.3.0-logilab.1.el7.centos~revf3ab15166db9.x86_64/usr/lib/python2.7/site-packages/logilab/common

copying logilab/common/tasksqueue.py -&gt; /builddir/build/BUILDROOT/python-logilab-common-1.3.0-logilab.1.el7.centos~revf3ab15166db9.x86_64/usr/lib/python2.7/site-packages/logilab/common

copying logilab/common/changelog.py -&gt; /builddir/build/BUILDROOT/python-logilab-common-1.3.0-logilab.1.el7.centos~revf3ab15166db9.x86_64/usr/lib/python2.7/site-packages/logilab/common

copying logilab/common/debugger.py -&gt; /builddir/build/BUILDROOT/python-logilab-common-1.3.0-logilab.1.el7.centos~revf3ab15166db9.x86_64/usr/lib/python2.7/site-packages/logilab/common

copying logilab/common/cache.py -&gt; /builddir/build/BUILDROOT/python-logilab-common-1.3.0-logilab.1.el7.centos~revf3ab15166db9.x86_64/usr/lib/python2.7/site-packages/logilab/common

copying logilab/common/fileutils.py -&gt; /builddir/build/BUILDROOT/python-logilab-common-1.3.0-logilab.1.el7.centos~revf3ab15166db9.x86_64/usr/lib/python2.7/site-packages/logilab/common

copying logilab/common/modutils.py -&gt; /builddir/build/BUILDROOT/python-logilab-common-1.3.0-logilab.1.el7.centos~revf3ab15166db9.x86_64/usr/lib/python2.7/site-packages/logilab/common

copying logilab/common/pytest.py -&gt; /builddir/build/BUILDROOT/python-logilab-common-1.3.0-logilab.1.el7.centos~revf3ab15166db9.x86_64/usr/lib/python2.7/site-packages/logilab/common

copying logilab/common/visitor.py -&gt; /builddir/build/BUILDROOT/python-logilab-common-1.3.0-logilab.1.el7.centos~revf3ab15166db9.x86_64/usr/lib/python2.7/site-packages/logilab/common

copying logilab/common/graph.py -&gt; /builddir/build/BUILDROOT/python-logilab-common-1.3.0-logilab.1.el7.centos~revf3ab15166db9.x86_64/usr/lib/python2.7/site-packages/logilab/common

copying logilab/common/vcgutils.py -&gt; /builddir/build/BUILDROOT/python-logilab-common-1.3.0-logilab.1.el7.centos~revf3ab15166db9.x86_64/usr/lib/python2.7/site-packages/logilab/common

copying logilab/common/tree.py -&gt; /builddir/build/BUILDROOT/python-logilab-common-1.3.0-logilab.1.el7.centos~revf3ab15166db9.x86_64/usr/lib/python2.7/site-packages/logilab/common

copying logilab/common/textutils.py -&gt; /builddir/build/BUILDROOT/python-logilab-common-1.3.0-logilab.1.el7.centos~revf3ab15166db9.x86_64/usr/lib/python2.7/site-packages/logilab/common

copying logilab/common/compat.py -&gt; /builddir/build/BUILDROOT/python-logilab-common-1.3.0-logilab.1.el7.centos~revf3ab15166db9.x86_64/usr/lib/python2.7/site-packages/logilab/common

copying logilab/common/registry.py -&gt; /builddir/build/BUILDROOT/python-logilab-common-1.3.0-logilab.1.el7.centos~revf3ab15166db9.x86_64/usr/lib/python2.7/site-packages/logilab/common

copying logilab/common/date.py -&gt; /builddir/build/BUILDROOT/python-logilab-common-1.3.0-logilab.1.el7.centos~revf3ab15166db9.x86_64/usr/lib/python2.7/site-packages/logilab/common

copying logilab/common/xmlutils.py -&gt; /builddir/build/BUILDROOT/python-logilab-common-1.3.0-logilab.1.el7.centos~revf3ab15166db9.x86_64/usr/lib/python2.7/site-packages/logilab/common

copying logilab/common/sphinx_ext.py -&gt; /builddir/build/BUILDROOT/python-logilab-common-1.3.0-logilab.1.el7.centos~revf3ab15166db9.x86_64/usr/lib/python2.7/site-packages/logilab/common

copying logilab/common/urllib2ext.py -&gt; /builddir/build/BUILDROOT/python-logilab-common-1.3.0-logilab.1.el7.centos~revf3ab15166db9.x86_64/usr/lib/python2.7/site-packages/logilab/common

copying logilab/common/table.py -&gt; /builddir/build/BUILDROOT/python-logilab-common-1.3.0-logilab.1.el7.centos~revf3ab15166db9.x86_64/usr/lib/python2.7/site-packages/logilab/common

copying logilab/common/testlib.py -&gt; /builddir/build/BUILDROOT/python-logilab-common-1.3.0-logilab.1.el7.centos~revf3ab15166db9.x86_64/usr/lib/python2.7/site-packages/logilab/common

copying logilab/common/proc.py -&gt; /builddir/build/BUILDROOT/python-logilab-common-1.3.0-logilab.1.el7.centos~revf3ab15166db9.x86_64/usr/lib/python2.7/site-packages/logilab/common

copying logilab/common/clcommands.py -&gt; /builddir/build/BUILDROOT/python-logilab-common-1.3.0-logilab.1.el7.centos~revf3ab15166db9.x86_64/usr/lib/python2.7/site-packages/logilab/common

copying logilab/common/logging_ext.py -&gt; /builddir/build/BUILDROOT/python-logilab-common-1.3.0-logilab.1.el7.centos~revf3ab15166db9.x86_64/usr/lib/python2.7/site-packages/logilab/common

copying logilab/common/__init__.py -&gt; /builddir/build/BUILDROOT/python-logilab-common-1.3.0-logilab.1.el7.centos~revf3ab15166db9.x86_64/usr/lib/python2.7/site-packages/logilab/common

copying logilab/common/decorators.py -&gt; /builddir/build/BUILDROOT/python-logilab-common-1.3.0-logilab.1.el7.centos~revf3ab15166db9.x86_64/usr/lib/python2.7/site-packages/logilab/common

copying logilab/common/daemon.py -&gt; /builddir/build/BUILDROOT/python-logilab-common-1.3.0-logilab.1.el7.centos~revf3ab15166db9.x86_64/usr/lib/python2.7/site-packages/logilab/common

copying logilab/common/shellutils.py -&gt; /builddir/build/BUILDROOT/python-logilab-common-1.3.0-logilab.1.el7.centos~revf3ab15166db9.x86_64/usr/lib/python2.7/site-packages/logilab/common

copying logilab/common/configuration.py -&gt; /builddir/build/BUILDROOT/python-logilab-common-1.3.0-logilab.1.el7.centos~revf3ab15166db9.x86_64/usr/lib/python2.7/site-packages/logilab/common

copying logilab/common/optparser.py -&gt; /builddir/build/BUILDROOT/python-logilab-common-1.3.0-logilab.1.el7.centos~revf3ab15166db9.x86_64/usr/lib/python2.7/site-packages/logilab/common

copying logilab/common/deprecation.py -&gt; /builddir/build/BUILDROOT/python-logilab-common-1.3.0-logilab.1.el7.centos~revf3ab15166db9.x86_64/usr/lib/python2.7/site-packages/logilab/common

copying logilab/common/optik_ext.py -&gt; /builddir/build/BUILDROOT/python-logilab-common-1.3.0-logilab.1.el7.centos~revf3ab15166db9.x86_64/usr/lib/python2.7/site-packages/logilab/common

copying logilab/common/umessage.py -&gt; /builddir/build/BUILDROOT/python-logilab-common-1.3.0-logilab.1.el7.centos~revf3ab15166db9.x86_64/usr/lib/python2.7/site-packages/logilab/common

copying logilab/common/interface.py -&gt; /builddir/build/BUILDROOT/python-logilab-common-1.3.0-logilab.1.el7.centos~revf3ab15166db9.x86_64/usr/lib/python2.7/site-packages/logilab/common

copying logilab/common/ureports/html_writer.py -&gt; /builddir/build/BUILDROOT/python-logilab-common-1.3.0-logilab.1.el7.centos~revf3ab15166db9.x86_64/usr/lib/python2.7/site-packages/logilab/common/ureports

copying logilab/common/ureports/nodes.py -&gt; /builddir/build/BUILDROOT/python-logilab-common-1.3.0-logilab.1.el7.centos~revf3ab15166db9.x86_64/usr/lib/python2.7/site-packages/logilab/common/ureports

copying logilab/common/ureports/docbook_writer.py -&gt; /builddir/build/BUILDROOT/python-logilab-common-1.3.0-logilab.1.el7.centos~revf3ab15166db9.x86_64/usr/lib/python2.7/site-packages/logilab/common/ureports

copying logilab/common/ureports/__init__.py -&gt; /builddir/build/BUILDROOT/python-logilab-common-1.3.0-logilab.1.el7.centos~revf3ab15166db9.x86_64/usr/lib/python2.7/site-packages/logilab/common/ureports

copying logilab/common/ureports/text_writer.py -&gt; /builddir/build/BUILDROOT/python-logilab-common-1.3.0-logilab.1.el7.centos~revf3ab15166db9.x86_64/usr/lib/python2.7/site-packages/logilab/common/ureports

byte-compiling /builddir/build/BUILDROOT/python-logilab-common-1.3.0-logilab.1.el7.centos~revf3ab15166db9.x86_64/usr/lib/python2.7/site-packages/logilab/common/sphinxutils.py to sphinxutils.pyc

byte-compiling /builddir/build/BUILDROOT/python-logilab-common-1.3.0-logilab.1.el7.centos~revf3ab15166db9.x86_64/usr/lib/python2.7/site-packages/logilab/common/tasksqueue.py to tasksqueue.pyc

byte-compiling /builddir/build/BUILDROOT/python-logilab-common-1.3.0-logilab.1.el7.centos~revf3ab15166db9.x86_64/usr/lib/python2.7/site-packages/logilab/common/changelog.py to changelog.pyc

byte-compiling /builddir/build/BUILDROOT/python-logilab-common-1.3.0-logilab.1.el7.centos~revf3ab15166db9.x86_64/usr/lib/python2.7/site-packages/logilab/common/debugger.py to debugger.pyc

byte-compiling /builddir/build/BUILDROOT/python-logilab-common-1.3.0-logilab.1.el7.centos~revf3ab15166db9.x86_64/usr/lib/python2.7/site-packages/logilab/common/cache.py to cache.pyc

byte-compiling /builddir/build/BUILDROOT/python-logilab-common-1.3.0-logilab.1.el7.centos~revf3ab15166db9.x86_64/usr/lib/python2.7/site-packages/logilab/common/fileutils.py to fileutils.pyc

byte-compiling /builddir/build/BUILDROOT/python-logilab-common-1.3.0-logilab.1.el7.centos~revf3ab15166db9.x86_64/usr/lib/python2.7/site-packages/logilab/common/modutils.py to modutils.pyc

byte-compiling /builddir/build/BUILDROOT/python-logilab-common-1.3.0-logilab.1.el7.centos~revf3ab15166db9.x86_64/usr/lib/python2.7/site-packages/logilab/common/pytest.py to pytest.pyc

byte-compiling /builddir/build/BUILDROOT/python-logilab-common-1.3.0-logilab.1.el7.centos~revf3ab15166db9.x86_64/usr/lib/python2.7/site-packages/logilab/common/visitor.py to visitor.pyc

byte-compiling /builddir/build/BUILDROOT/python-logilab-common-1.3.0-logilab.1.el7.centos~revf3ab15166db9.x86_64/usr/lib/python2.7/site-packages/logilab/common/graph.py to graph.pyc

byte-compiling /builddir/build/BUILDROOT/python-logilab-common-1.3.0-logilab.1.el7.centos~revf3ab15166db9.x86_64/usr/lib/python2.7/site-packages/logilab/common/vcgutils.py to vcgutils.pyc

byte-compiling /builddir/build/BUILDROOT/python-logilab-common-1.3.0-logilab.1.el7.centos~revf3ab15166db9.x86_64/usr/lib/python2.7/site-packages/logilab/common/tree.py to tree.pyc

byte-compiling /builddir/build/BUILDROOT/python-logilab-common-1.3.0-logilab.1.el7.centos~revf3ab15166db9.x86_64/usr/lib/python2.7/site-packages/logilab/common/textutils.py to textutils.pyc

byte-compiling /builddir/build/BUILDROOT/python-logilab-common-1.3.0-logilab.1.el7.centos~revf3ab15166db9.x86_64/usr/lib/python2.7/site-packages/logilab/common/compat.py to compat.pyc

byte-compiling /builddir/build/BUILDROOT/python-logilab-common-1.3.0-logilab.1.el7.centos~revf3ab15166db9.x86_64/usr/lib/python2.7/site-packages/logilab/common/registry.py to registry.pyc

byte-compiling /builddir/build/BUILDROOT/python-logilab-common-1.3.0-logilab.1.el7.centos~revf3ab15166db9.x86_64/usr/lib/python2.7/site-packages/logilab/common/date.py to date.pyc

byte-compiling /builddir/build/BUILDROOT/python-logilab-common-1.3.0-logilab.1.el7.centos~revf3ab15166db9.x86_64/usr/lib/python2.7/site-packages/logilab/common/xmlutils.py to xmlutils.pyc

byte-compiling /builddir/build/BUILDROOT/python-logilab-common-1.3.0-logilab.1.el7.centos~revf3ab15166db9.x86_64/usr/lib/python2.7/site-packages/logilab/common/sphinx_ext.py to sphinx_ext.pyc

byte-compiling /builddir/build/BUILDROOT/python-logilab-common-1.3.0-logilab.1.el7.centos~revf3ab15166db9.x86_64/usr/lib/python2.7/site-packages/logilab/common/urllib2ext.py to urllib2ext.pyc

byte-compiling /builddir/build/BUILDROOT/python-logilab-common-1.3.0-logilab.1.el7.centos~revf3ab15166db9.x86_64/usr/lib/python2.7/site-packages/logilab/common/table.py to table.pyc

byte-compiling /builddir/build/BUILDROOT/python-logilab-common-1.3.0-logilab.1.el7.centos~revf3ab15166db9.x86_64/usr/lib/python2.7/site-packages/logilab/common/testlib.py to testlib.pyc

byte-compiling /builddir/build/BUILDROOT/python-logilab-common-1.3.0-logilab.1.el7.centos~revf3ab15166db9.x86_64/usr/lib/python2.7/site-packages/logilab/common/proc.py to proc.pyc

byte-compiling /builddir/build/BUILDROOT/python-logilab-common-1.3.0-logilab.1.el7.centos~revf3ab15166db9.x86_64/usr/lib/python2.7/site-packages/logilab/common/clcommands.py to clcommands.pyc

byte-compiling /builddir/build/BUILDROOT/python-logilab-common-1.3.0-logilab.1.el7.centos~revf3ab15166db9.x86_64/usr/lib/python2.7/site-packages/logilab/common/logging_ext.py to logging_ext.pyc

byte-compiling /builddir/build/BUILDROOT/python-logilab-common-1.3.0-logilab.1.el7.centos~revf3ab15166db9.x86_64/usr/lib/python2.7/site-packages/logilab/common/__init__.py to __init__.pyc

byte-compiling /builddir/build/BUILDROOT/python-logilab-common-1.3.0-logilab.1.el7.centos~revf3ab15166db9.x86_64/usr/lib/python2.7/site-packages/logilab/common/decorators.py to decorators.pyc

byte-compiling /builddir/build/BUILDROOT/python-logilab-common-1.3.0-logilab.1.el7.centos~revf3ab15166db9.x86_64/usr/lib/python2.7/site-packages/logilab/common/daemon.py to daemon.pyc

byte-compiling /builddir/build/BUILDROOT/python-logilab-common-1.3.0-logilab.1.el7.centos~revf3ab15166db9.x86_64/usr/lib/python2.7/site-packages/logilab/common/shellutils.py to shellutils.pyc

byte-compiling /builddir/build/BUILDROOT/python-logilab-common-1.3.0-logilab.1.el7.centos~revf3ab15166db9.x86_64/usr/lib/python2.7/site-packages/logilab/common/configuration.py to configuration.pyc

byte-compiling /builddir/build/BUILDROOT/python-logilab-common-1.3.0-logilab.1.el7.centos~revf3ab15166db9.x86_64/usr/lib/python2.7/site-packages/logilab/common/optparser.py to optparser.pyc

byte-compiling /builddir/build/BUILDROOT/python-logilab-common-1.3.0-logilab.1.el7.centos~revf3ab15166db9.x86_64/usr/lib/python2.7/site-packages/logilab/common/deprecation.py to deprecation.pyc

byte-compiling /builddir/build/BUILDROOT/python-logilab-common-1.3.0-logilab.1.el7.centos~revf3ab15166db9.x86_64/usr/lib/python2.7/site-packages/logilab/common/optik_ext.py to optik_ext.pyc

byte-compiling /builddir/build/BUILDROOT/python-logilab-common-1.3.0-logilab.1.el7.centos~revf3ab15166db9.x86_64/usr/lib/python2.7/site-packages/logilab/common/umessage.py to umessage.pyc

byte-compiling /builddir/build/BUILDROOT/python-logilab-common-1.3.0-logilab.1.el7.centos~revf3ab15166db9.x86_64/usr/lib/python2.7/site-packages/logilab/common/interface.py to interface.pyc

byte-compiling /builddir/build/BUILDROOT/python-logilab-common-1.3.0-logilab.1.el7.centos~revf3ab15166db9.x86_64/usr/lib/python2.7/site-packages/logilab/common/ureports/html_writer.py to html_writer.pyc

byte-compiling /builddir/build/BUILDROOT/python-logilab-common-1.3.0-logilab.1.el7.centos~revf3ab15166db9.x86_64/usr/lib/python2.7/site-packages/logilab/common/ureports/nodes.py to nodes.pyc

byte-compiling /builddir/build/BUILDROOT/python-logilab-common-1.3.0-logilab.1.el7.centos~revf3ab15166db9.x86_64/usr/lib/python2.7/site-packages/logilab/common/ureports/docbook_writer.py to docbook_writer.pyc

byte-compiling /builddir/build/BUILDROOT/python-logilab-common-1.3.0-logilab.1.el7.centos~revf3ab15166db9.x86_64/usr/lib/python2.7/site-packages/logilab/common/ureports/__init__.py to __init__.pyc

byte-compiling /builddir/build/BUILDROOT/python-logilab-common-1.3.0-logilab.1.el7.centos~revf3ab15166db9.x86_64/usr/lib/python2.7/site-packages/logilab/common/ureports/text_writer.py to text_writer.pyc

writing byte-compilation script &#39;/tmp/tmpHKSz4Y.py&#39;

/usr/bin/python -O /tmp/tmpHKSz4Y.py

removing /tmp/tmpHKSz4Y.py

running install_egg_info

running egg_info

writing requirements to logilab_common.egg-info/requires.txt

writing logilab_common.egg-info/PKG-INFO

writing namespace_packages to logilab_common.egg-info/namespace_packages.txt

writing top-level names to logilab_common.egg-info/top_level.txt

writing dependency_links to logilab_common.egg-info/dependency_links.txt

reading manifest file &#39;logilab_common.egg-info/SOURCES.txt&#39;

reading manifest template &#39;MANIFEST.in&#39;

warning: no files found matching &#39;*.py&#39; under directory &#39;test/input&#39;

warning: no files found matching &#39;*&#39; under directory &#39;doc/html&#39;

writing manifest file &#39;logilab_common.egg-info/SOURCES.txt&#39;

Copying logilab_common.egg-info to /builddir/build/BUILDROOT/python-logilab-common-1.3.0-logilab.1.el7.centos~revf3ab15166db9.x86_64/usr/lib/python2.7/site-packages/logilab_common-1.3.0-py2.7.egg-info

Installing /builddir/build/BUILDROOT/python-logilab-common-1.3.0-logilab.1.el7.centos~revf3ab15166db9.x86_64/usr/lib/python2.7/site-packages/logilab_common-1.3.0-py2.7-nspkg.pth

running install_scripts

creating /builddir/build/BUILDROOT/python-logilab-common-1.3.0-logilab.1.el7.centos~revf3ab15166db9.x86_64/usr/bin

copying build/scripts-2.7/logilab-pytest -&gt; /builddir/build/BUILDROOT/python-logilab-common-1.3.0-logilab.1.el7.centos~revf3ab15166db9.x86_64/usr/bin

changing mode of /builddir/build/BUILDROOT/python-logilab-common-1.3.0-logilab.1.el7.centos~revf3ab15166db9.x86_64/usr/bin/logilab-pytest to 755

+ rm -rf /builddir/build/BUILDROOT/python-logilab-common-1.3.0-logilab.1.el7.centos~revf3ab15166db9.x86_64/usr/lib/python2.7/site-packages/logilab/common/test

+ /usr/lib/rpm/find-debuginfo.sh --strict-build-id -m --run-dwz --dwz-low-mem-die-limit 10000000 --dwz-max-die-limit 110000000 /builddir/build/BUILD/logilab-common-1.3.0

/usr/lib/rpm/sepdebugcrcfix: Updated 0 CRC32s, 0 CRC32s did match.

find: &#39;debug&#39;: No such file or directory

+ /usr/lib/rpm/check-buildroot

+ /usr/lib/rpm/redhat/brp-compress

+ /usr/lib/rpm/redhat/brp-strip-static-archive /usr/bin/strip

+ /usr/lib/rpm/brp-python-bytecompile /usr/bin/python 1

Bytecompiling .py files below /builddir/build/BUILDROOT/python-logilab-common-1.3.0-logilab.1.el7.centos~revf3ab15166db9.x86_64/usr/lib/python2.7 using /usr/bin/python2.7

+ /usr/lib/rpm/redhat/brp-python-hardlink

+ /usr/lib/rpm/redhat/brp-java-repack-jars

Executing(%check): /bin/sh -e /var/tmp/rpm-tmp.wivXq0

+ umask 022

+ cd /builddir/build/BUILD

+ cd logilab-common-1.3.0

+ /usr/bin/python setup.py test

running test

Searching for egenix-mx-base

Reading https://pypi.python.org/simple/egenix-mx-base/

Best match: egenix-mx-base 3.2.9

Downloading https://pypi.python.org/packages/66/e6/e0709aedeb4a5c92a1aeb8c47ab50e9506eafc865806801bd3f01d72b671/egenix-mx-base-3.2.9.zip#md5=9727f4437641a4cfedb9927c152de738

Processing egenix-mx-base-3.2.9.zip

Writing /tmp/easy_install-zpoB1M/egenix-mx-base-3.2.9/setup.cfg

Running egenix-mx-base-3.2.9/setup.py -q bdist_egg --dist-dir /tmp/easy_install-zpoB1M/egenix-mx-base-3.2.9/egg-dist-tmp-laHIX_

Warning: Can&#39;t read registry to find the necessary compiler setting

Make sure that Python modules _winreg, win32api or win32con are installed.

web installer running

trying to find suitable download package

found package URL https://downloads.egenix.com/python/egenix-mx-base-3.2.9-py2.7_ucs4-linux-x86_64-prebuilt.zip#md5=1e98d2daccd22c33103980a520a6c53d&amp;sha1=5a94a58f1c6bcd9b8cfa671de93b3aa81555169c&amp;sha256=6797559de9d103a35f4d134a18db7b7c4764ce562053a2142ec2d34b79d59da5&amp;size=4739155

downloading web package https://downloads.egenix.com/python/egenix-mx-base-3.2.9-py2.7_ucs4-linux-x86_64-prebuilt.zip

verifying web package /tmp/easy_install-zpoB1M/egenix-mx-base-3.2.9/egenix-mx-base-3.2.9-py2.7_ucs4-linux-x86_64-prebuilt.zip

extracting web package /tmp/easy_install-zpoB1M/egenix-mx-base-3.2.9/egenix-mx-base-3.2.9-py2.7_ucs4-linux-x86_64-prebuilt.zip into /tmp/easy_install-zpoB1M/egenix-mx-base-3.2.9

Installed /builddir/build/BUILD/logilab-common-1.3.0/egenix_mx_base-3.2.9-py2.7-linux-x86_64.egg

+ exit 0

Processing files: python-logilab-common-1.3.0-logilab.1.el7.centos~revf3ab15166db9.noarch

Executing(%doc): /bin/sh -e /var/tmp/rpm-tmp.7WAuii

+ umask 022

+ cd /builddir/build/BUILD

+ cd logilab-common-1.3.0

+ DOCDIR=/builddir/build/BUILDROOT/python-logilab-common-1.3.0-logilab.1.el7.centos~revf3ab15166db9.x86_64/usr/share/doc/python-logilab-common-1.3.0

+ export DOCDIR

+ /usr/bin/mkdir -p /builddir/build/BUILDROOT/python-logilab-common-1.3.0-logilab.1.el7.centos~revf3ab15166db9.x86_64/usr/share/doc/python-logilab-common-1.3.0

+ cp -pr README /builddir/build/BUILDROOT/python-logilab-common-1.3.0-logilab.1.el7.centos~revf3ab15166db9.x86_64/usr/share/doc/python-logilab-common-1.3.0

+ cp -pr ChangeLog /builddir/build/BUILDROOT/python-logilab-common-1.3.0-logilab.1.el7.centos~revf3ab15166db9.x86_64/usr/share/doc/python-logilab-common-1.3.0

+ cp -pr COPYING /builddir/build/BUILDROOT/python-logilab-common-1.3.0-logilab.1.el7.centos~revf3ab15166db9.x86_64/usr/share/doc/python-logilab-common-1.3.0

+ exit 0

Provides: python-logilab-common = 1.3.0-logilab.1.el7.centos~revf3ab15166db9

Requires(rpmlib): rpmlib(CompressedFileNames) &lt;= 3.0.4-1 rpmlib(FileDigests) &lt;= 4.6.0-1 rpmlib(PartialHardlinkSets) &lt;= 4.0.4-1 rpmlib(PayloadFilesHavePrefix) &lt;= 4.0-1

Requires: /usr/bin/python python(abi) = 2.7

Checking for unpackaged file(s): /usr/lib/rpm/check-files /builddir/build/BUILDROOT/python-logilab-common-1.3.0-logilab.1.el7.centos~revf3ab15166db9.x86_64

Wrote: /builddir/build/RPMS/python-logilab-common-1.3.0-logilab.1.el7.centos~revf3ab15166db9.noarch.rpm

Executing(%clean): /bin/sh -e /var/tmp/rpm-tmp.Bmf9jX

+ umask 022

+ cd /builddir/build/BUILD

+ cd logilab-common-1.3.0

+ rm -rf /builddir/build/BUILDROOT/python-logilab-common-1.3.0-logilab.1.el7.centos~revf3ab15166db9.x86_64

+ exit 0

Child return code was: 0

LEAVE do --&gt;

<br/>20 printing /tmp/tmp3xvLni/common/../epel-7-x86_64/root.log: INFO backend.py:1016: Mock Version: 1.1.33

DEBUG backend.py:334: rootdir = /var/lib/mock/epel-7-x86_64-4888/root/

DEBUG backend.py:335: resultdir = /tmp/tmpE_0cl1

INFO backend.py:338: calling preinit hooks

DEBUG util.py:64: ensuring that dir exists: /var/cache/mock/epel-7-x86_64/root_cache/

DEBUG util.py:316: Executing command: [&#39;tar&#39;, &#39;--use-compress-program&#39;, &#39;gzip&#39;, &#39;-xf&#39;, &#39;/var/cache/mock/epel-7-x86_64/root_cache/cache.tar.gz&#39;, &#39;-C&#39;, &#39;/var/lib/mock/epel-7-x86_64-4888/root/&#39;] with env {&#39;LANG&#39;: &#39;en_US.UTF-8&#39;, &#39;TERM&#39;: &#39;vt100&#39;, &#39;SHELL&#39;: &#39;/bin/bash&#39;, &#39;HOSTNAME&#39;: &#39;mock&#39;, &#39;HOME&#39;: &#39;/builddir&#39;, &#39;PATH&#39;: &#39;/usr/bin:/bin:/usr/sbin:/sbin&#39;}

DEBUG util.py:356: Child return code was: 0

DEBUG util.py:64: ensuring that dir exists: /var/lib/mock/epel-7-x86_64-4888/root/./proc

DEBUG util.py:67: creating dir: /var/lib/mock/epel-7-x86_64-4888/root/./proc

DEBUG util.py:64: ensuring that dir exists: /var/lib/mock/epel-7-x86_64-4888/root/./sys

DEBUG util.py:67: creating dir: /var/lib/mock/epel-7-x86_64-4888/root/./sys

DEBUG util.py:64: ensuring that dir exists: /var/lib/mock/epel-7-x86_64-4888/root/./dev

DEBUG util.py:67: creating dir: /var/lib/mock/epel-7-x86_64-4888/root/./dev

DEBUG util.py:64: ensuring that dir exists: /var/lib/mock/epel-7-x86_64-4888/root/./tmp/ccache

DEBUG util.py:67: creating dir: /var/lib/mock/epel-7-x86_64-4888/root/./tmp/ccache

DEBUG util.py:64: ensuring that dir exists: /var/lib/mock/epel-7-x86_64-4888/root/./var/cache/yum

DEBUG util.py:67: creating dir: /var/lib/mock/epel-7-x86_64-4888/root/./var/cache/yum

DEBUG util.py:64: ensuring that dir exists: /var/lib/mock/epel-7-x86_64-4888/root/var/cache/yum

DEBUG util.py:64: ensuring that dir exists: /var/lib/mock/epel-7-x86_64-4888/root/tmp/ccache

DEBUG util.py:64: ensuring that dir exists: /var/cache/mock/epel-7-x86_64/ccache/

DEBUG backend.py:505: create skeleton dirs

DEBUG util.py:64: ensuring that dir exists: /var/lib/mock/epel-7-x86_64-4888/root/var/lib/rpm

DEBUG util.py:64: ensuring that dir exists: /var/lib/mock/epel-7-x86_64-4888/root/var/lib/yum

DEBUG util.py:64: ensuring that dir exists: /var/lib/mock/epel-7-x86_64-4888/root/var/lib/dbus

DEBUG util.py:64: ensuring that dir exists: /var/lib/mock/epel-7-x86_64-4888/root/var/log

DEBUG util.py:64: ensuring that dir exists: /var/lib/mock/epel-7-x86_64-4888/root/var/cache/yum

DEBUG util.py:64: ensuring that dir exists: /var/lib/mock/epel-7-x86_64-4888/root/etc/rpm

DEBUG util.py:64: ensuring that dir exists: /var/lib/mock/epel-7-x86_64-4888/root/tmp

DEBUG util.py:64: ensuring that dir exists: /var/lib/mock/epel-7-x86_64-4888/root/tmp/ccache

DEBUG util.py:64: ensuring that dir exists: /var/lib/mock/epel-7-x86_64-4888/root/var/tmp

DEBUG util.py:64: ensuring that dir exists: /var/lib/mock/epel-7-x86_64-4888/root/etc/yum.repos.d

DEBUG util.py:64: ensuring that dir exists: /var/lib/mock/epel-7-x86_64-4888/root/etc/yum

DEBUG util.py:64: ensuring that dir exists: /var/lib/mock/epel-7-x86_64-4888/root/proc

DEBUG util.py:64: ensuring that dir exists: /var/lib/mock/epel-7-x86_64-4888/root/sys

DEBUG backend.py:526: touch required files

DEBUG util.py:75: touching file: /var/lib/mock/epel-7-x86_64-4888/root/etc/mtab

DEBUG util.py:75: touching file: /var/lib/mock/epel-7-x86_64-4888/root/etc/fstab

DEBUG util.py:75: touching file: /var/lib/mock/epel-7-x86_64-4888/root/var/log/yum.log

DEBUG backend.py:353: configure yum

DEBUG backend.py:368: configure yum priorities

DEBUG util.py:64: ensuring that dir exists: /var/lib/mock/epel-7-x86_64-4888/root/etc/yum/pluginconf.d

DEBUG backend.py:377: configure yum rhnplugin

DEBUG util.py:64: ensuring that dir exists: /var/lib/mock/epel-7-x86_64-4888/root/etc/yum/pluginconf.d

DEBUG util.py:90: remove tree: /var/lib/mock/epel-7-x86_64-4888/root/dev

DEBUG util.py:64: ensuring that dir exists: /var/lib/mock/epel-7-x86_64-4888/root/dev/pts

DEBUG util.py:67: creating dir: /var/lib/mock/epel-7-x86_64-4888/root/dev/pts

DEBUG util.py:64: ensuring that dir exists: /var/lib/mock/epel-7-x86_64-4888/root/dev/shm

DEBUG util.py:67: creating dir: /var/lib/mock/epel-7-x86_64-4888/root/dev/shm

DEBUG backend.py:472: kver == 3.16.0-4-amd64

DEBUG util.py:316: Executing command: [&#39;/bin/mount&#39;, &#39;-n&#39;, &#39;-t&#39;, &#39;proc&#39;, &#39;proc&#39;, &#39;/var/lib/mock/epel-7-x86_64-4888/root/proc&#39;] with env {&#39;LANG&#39;: &#39;en_US.UTF-8&#39;, &#39;TERM&#39;: &#39;vt100&#39;, &#39;SHELL&#39;: &#39;/bin/bash&#39;, &#39;HOSTNAME&#39;: &#39;mock&#39;, &#39;HOME&#39;: &#39;/builddir&#39;, &#39;PATH&#39;: &#39;/usr/bin:/bin:/usr/sbin:/sbin&#39;}

DEBUG util.py:356: Child return code was: 0

DEBUG util.py:316: Executing command: [&#39;/bin/mount&#39;, &#39;-n&#39;, &#39;-t&#39;, &#39;sysfs&#39;, &#39;mock_chroot_sys&#39;, &#39;/var/lib/mock/epel-7-x86_64-4888/root/sys&#39;] with env {&#39;LANG&#39;: &#39;en_US.UTF-8&#39;, &#39;TERM&#39;: &#39;vt100&#39;, &#39;SHELL&#39;: &#39;/bin/bash&#39;, &#39;HOSTNAME&#39;: &#39;mock&#39;, &#39;HOME&#39;: &#39;/builddir&#39;, &#39;PATH&#39;: &#39;/usr/bin:/bin:/usr/sbin:/sbin&#39;}

DEBUG util.py:356: Child return code was: 0

DEBUG util.py:316: Executing command: [&#39;/bin/mount&#39;, &#39;-n&#39;, &#39;-t&#39;, &#39;tmpfs&#39;, &#39;mock_chroot_shmfs&#39;, &#39;/var/lib/mock/epel-7-x86_64-4888/root/dev/shm&#39;] with env {&#39;LANG&#39;: &#39;en_US.UTF-8&#39;, &#39;TERM&#39;: &#39;vt100&#39;, &#39;SHELL&#39;: &#39;/bin/bash&#39;, &#39;HOSTNAME&#39;: &#39;mock&#39;, &#39;HOME&#39;: &#39;/builddir&#39;, &#39;PATH&#39;: &#39;/usr/bin:/bin:/usr/sbin:/sbin&#39;}

DEBUG util.py:356: Child return code was: 0

DEBUG util.py:316: Executing command: [&#39;/bin/mount&#39;, &#39;-n&#39;, &#39;-t&#39;, &#39;devpts&#39;, &#39;-o&#39;, &#39;gid=5,mode=0620,ptmxmode=0666,newinstance&#39;, &#39;mock_chroot_devpts&#39;, &#39;/var/lib/mock/epel-7-x86_64-4888/root/dev/pts&#39;] with env {&#39;LANG&#39;: &#39;en_US.UTF-8&#39;, &#39;TERM&#39;: &#39;vt100&#39;, &#39;SHELL&#39;: &#39;/bin/bash&#39;, &#39;HOSTNAME&#39;: &#39;mock&#39;, &#39;HOME&#39;: &#39;/builddir&#39;, &#39;PATH&#39;: &#39;/usr/bin:/bin:/usr/sbin:/sbin&#39;}

DEBUG util.py:356: Child return code was: 0

DEBUG util.py:316: Executing command: [&#39;/bin/mount&#39;, &#39;-n&#39;, &#39;--bind&#39;, &#39;/var/cache/mock/epel-7-x86_64/yum_cache/&#39;, &#39;/var/lib/mock/epel-7-x86_64-4888/root/var/cache/yum&#39;] with env {&#39;LANG&#39;: &#39;en_US.UTF-8&#39;, &#39;TERM&#39;: &#39;vt100&#39;, &#39;SHELL&#39;: &#39;/bin/bash&#39;, &#39;HOSTNAME&#39;: &#39;mock&#39;, &#39;HOME&#39;: &#39;/builddir&#39;, &#39;PATH&#39;: &#39;/usr/bin:/bin:/usr/sbin:/sbin&#39;}

DEBUG util.py:356: Child return code was: 0

DEBUG util.py:316: Executing command: [&#39;/bin/mount&#39;, &#39;-n&#39;, &#39;--bind&#39;, &#39;/var/cache/mock/epel-7-x86_64/ccache/&#39;, &#39;/var/lib/mock/epel-7-x86_64-4888/root/tmp/ccache&#39;] with env {&#39;LANG&#39;: &#39;en_US.UTF-8&#39;, &#39;TERM&#39;: &#39;vt100&#39;, &#39;SHELL&#39;: &#39;/bin/bash&#39;, &#39;HOSTNAME&#39;: &#39;mock&#39;, &#39;HOME&#39;: &#39;/builddir&#39;, &#39;PATH&#39;: &#39;/usr/bin:/bin:/usr/sbin:/sbin&#39;}

DEBUG util.py:356: Child return code was: 0

DEBUG backend.py:947: [&#39;/usr/bin/yum&#39;, &#39;--installroot&#39;, &#39;/var/lib/mock/epel-7-x86_64-4888/root/&#39;, &#39;update&#39;]

DEBUG util.py:316: Executing command: [&#39;/usr/bin/yum&#39;, &#39;--installroot&#39;, &#39;/var/lib/mock/epel-7-x86_64-4888/root/&#39;, &#39;update&#39;] with env {&#39;LANG&#39;: &#39;en_US.UTF-8&#39;, &#39;TERM&#39;: &#39;vt100&#39;, &#39;SHELL&#39;: &#39;/bin/bash&#39;, &#39;CCACHE_DIR&#39;: &#39;/tmp/ccache&#39;, &#39;HOSTNAME&#39;: &#39;mock&#39;, &#39;PROMPT_COMMAND&#39;: &#39;echo -n &quot;&lt;mock-chroot&gt;&quot;&#39;, &#39;HOME&#39;: &#39;/builddir&#39;, &#39;PATH&#39;: &#39;/usr/bin:/bin:/usr/sbin:/sbin&#39;, &#39;CCACHE_UMASK&#39;: &#39;002&#39;}

DEBUG util.py:266: Setting up Update Process

DEBUG util.py:266: No Packages marked for Update

DEBUG util.py:356: Child return code was: 0

DEBUG util.py:316: Executing command: /usr/bin/repoquery -c /var/lib/mock/epel-7-x86_64-4888/root//etc/yum.conf -a --qf &#39;%{nevra} %{buildtime} %{size} %{pkgid} %{repoid}&#39; &gt; /tmp/tmpE_0cl1/available_pkgs with env {&#39;LANG&#39;: &#39;en_US.UTF-8&#39;, &#39;TERM&#39;: &#39;vt100&#39;, &#39;SHELL&#39;: &#39;/bin/bash&#39;, &#39;HOSTNAME&#39;: &#39;mock&#39;, &#39;HOME&#39;: &#39;/builddir&#39;, &#39;PATH&#39;: &#39;/usr/bin:/bin:/usr/sbin:/sbin&#39;}

DEBUG util.py:266: Not using downloaded repomd.xml because it is older than what we have:

DEBUG util.py:266: Current : Sun May 22 07:52:33 2016

DEBUG util.py:266: Downloaded: Wed Dec 9 23:35:45 2015

DEBUG util.py:266: Not using downloaded repomd.xml because it is older than what we have:

DEBUG util.py:266: Current : Thu Nov 17 05:49:36 2016

DEBUG util.py:266: Downloaded: Wed Nov 16 23:59:35 2016

DEBUG util.py:266: Not using downloaded repomd.xml because it is older than what we have:

DEBUG util.py:266: Current : Sat Nov 12 07:48:25 2016

DEBUG util.py:266: Downloaded: Tue Oct 25 12:47:15 2016

DEBUG util.py:356: Child return code was: 0

DEBUG util.py:90: remove tree: /var/lib/mock/epel-7-x86_64-4888/root/builddir

DEBUG util.py:316: Executing command: [&#39;/usr/sbin/userdel&#39;, &#39;-r&#39;, &#39;-f&#39;, &#39;mockbuild&#39;] with env {&#39;LANG&#39;: &#39;en_US.UTF-8&#39;, &#39;TERM&#39;: &#39;vt100&#39;, &#39;SHELL&#39;: &#39;/bin/bash&#39;, &#39;CCACHE_DIR&#39;: &#39;/tmp/ccache&#39;, &#39;HOSTNAME&#39;: &#39;mock&#39;, &#39;PROMPT_COMMAND&#39;: &#39;echo -n &quot;&lt;mock-chroot&gt;&quot;&#39;, &#39;HOME&#39;: &#39;/builddir&#39;, &#39;PATH&#39;: &#39;/usr/bin:/bin:/usr/sbin:/sbin&#39;, &#39;CCACHE_UMASK&#39;: &#39;002&#39;}

DEBUG util.py:266: userdel: mockbuild home directory (/builddir) not found

DEBUG util.py:356: Child return code was: 0

DEBUG util.py:316: Executing command: [&#39;/usr/sbin/groupdel&#39;, &#39;mockbuild&#39;] with env {&#39;LANG&#39;: &#39;en_US.UTF-8&#39;, &#39;TERM&#39;: &#39;vt100&#39;, &#39;SHELL&#39;: &#39;/bin/bash&#39;, &#39;CCACHE_DIR&#39;: &#39;/tmp/ccache&#39;, &#39;HOSTNAME&#39;: &#39;mock&#39;, &#39;PROMPT_COMMAND&#39;: &#39;echo -n &quot;&lt;mock-chroot&gt;&quot;&#39;, &#39;HOME&#39;: &#39;/builddir&#39;, &#39;PATH&#39;: &#39;/usr/bin:/bin:/usr/sbin:/sbin&#39;, &#39;CCACHE_UMASK&#39;: &#39;002&#39;}

DEBUG util.py:266: groupdel: group &#39;mockbuild&#39; does not exist

DEBUG util.py:356: Child return code was: 6

DEBUG util.py:316: Executing command: [&#39;/usr/sbin/groupadd&#39;, &#39;-g&#39;, &#39;122&#39;, &#39;mockbuild&#39;] with env {&#39;LANG&#39;: &#39;en_US.UTF-8&#39;, &#39;TERM&#39;: &#39;vt100&#39;, &#39;SHELL&#39;: &#39;/bin/bash&#39;, &#39;CCACHE_DIR&#39;: &#39;/tmp/ccache&#39;, &#39;HOSTNAME&#39;: &#39;mock&#39;, &#39;PROMPT_COMMAND&#39;: &#39;echo -n &quot;&lt;mock-chroot&gt;&quot;&#39;, &#39;HOME&#39;: &#39;/builddir&#39;, &#39;PATH&#39;: &#39;/usr/bin:/bin:/usr/sbin:/sbin&#39;, &#39;CCACHE_UMASK&#39;: &#39;002&#39;}

DEBUG util.py:356: Child return code was: 0

DEBUG util.py:316: Executing command: /usr/sbin/useradd -o -m -u 111 -g 122 -d /builddir -n mockbuild with env {&#39;LANG&#39;: &#39;en_US.UTF-8&#39;, &#39;TERM&#39;: &#39;vt100&#39;, &#39;SHELL&#39;: &#39;/bin/bash&#39;, &#39;CCACHE_DIR&#39;: &#39;/tmp/ccache&#39;, &#39;HOSTNAME&#39;: &#39;mock&#39;, &#39;PROMPT_COMMAND&#39;: &#39;echo -n &quot;&lt;mock-chroot&gt;&quot;&#39;, &#39;HOME&#39;: &#39;/builddir&#39;, &#39;PATH&#39;: &#39;/usr/bin:/bin:/usr/sbin:/sbin&#39;, &#39;CCACHE_UMASK&#39;: &#39;002&#39;}

DEBUG util.py:356: Child return code was: 0

DEBUG util.py:64: ensuring that dir exists: /var/lib/mock/epel-7-x86_64-4888/root/builddir/build/RPMS

DEBUG util.py:67: creating dir: /var/lib/mock/epel-7-x86_64-4888/root/builddir/build/RPMS

DEBUG util.py:64: ensuring that dir exists: /var/lib/mock/epel-7-x86_64-4888/root/builddir/build/SRPMS

DEBUG util.py:67: creating dir: /var/lib/mock/epel-7-x86_64-4888/root/builddir/build/SRPMS

DEBUG util.py:64: ensuring that dir exists: /var/lib/mock/epel-7-x86_64-4888/root/builddir/build/SOURCES

DEBUG util.py:67: creating dir: /var/lib/mock/epel-7-x86_64-4888/root/builddir/build/SOURCES

DEBUG util.py:64: ensuring that dir exists: /var/lib/mock/epel-7-x86_64-4888/root/builddir/build/SPECS

DEBUG util.py:67: creating dir: /var/lib/mock/epel-7-x86_64-4888/root/builddir/build/SPECS

DEBUG util.py:64: ensuring that dir exists: /var/lib/mock/epel-7-x86_64-4888/root/builddir/build/BUILD

DEBUG util.py:67: creating dir: /var/lib/mock/epel-7-x86_64-4888/root/builddir/build/BUILD

DEBUG util.py:64: ensuring that dir exists: /var/lib/mock/epel-7-x86_64-4888/root/builddir/build/BUILDROOT

DEBUG util.py:67: creating dir: /var/lib/mock/epel-7-x86_64-4888/root/builddir/build/BUILDROOT

DEBUG util.py:64: ensuring that dir exists: /var/lib/mock/epel-7-x86_64-4888/root/builddir/build/originals

DEBUG util.py:67: creating dir: /var/lib/mock/epel-7-x86_64-4888/root/builddir/build/originals

DEBUG util.py:316: Executing command: [&#39;/bin/umount&#39;, &#39;-n&#39;, &#39;/var/lib/mock/epel-7-x86_64-4888/root/tmp/ccache&#39;] with env {&#39;LANG&#39;: &#39;en_US.UTF-8&#39;, &#39;TERM&#39;: &#39;vt100&#39;, &#39;SHELL&#39;: &#39;/bin/bash&#39;, &#39;HOSTNAME&#39;: &#39;mock&#39;, &#39;HOME&#39;: &#39;/builddir&#39;, &#39;PATH&#39;: &#39;/usr/bin:/bin:/usr/sbin:/sbin&#39;}

DEBUG util.py:356: Child return code was: 0

DEBUG util.py:316: Executing command: [&#39;/bin/umount&#39;, &#39;-n&#39;, &#39;/var/lib/mock/epel-7-x86_64-4888/root/var/cache/yum&#39;] with env {&#39;LANG&#39;: &#39;en_US.UTF-8&#39;, &#39;TERM&#39;: &#39;vt100&#39;, &#39;SHELL&#39;: &#39;/bin/bash&#39;, &#39;HOSTNAME&#39;: &#39;mock&#39;, &#39;HOME&#39;: &#39;/builddir&#39;, &#39;PATH&#39;: &#39;/usr/bin:/bin:/usr/sbin:/sbin&#39;}

DEBUG util.py:356: Child return code was: 0

DEBUG util.py:316: Executing command: [&#39;/bin/umount&#39;, &#39;-n&#39;, &#39;-l&#39;, &#39;/var/lib/mock/epel-7-x86_64-4888/root/dev/pts&#39;] with env {&#39;LANG&#39;: &#39;en_US.UTF-8&#39;, &#39;TERM&#39;: &#39;vt100&#39;, &#39;SHELL&#39;: &#39;/bin/bash&#39;, &#39;HOSTNAME&#39;: &#39;mock&#39;, &#39;HOME&#39;: &#39;/builddir&#39;, &#39;PATH&#39;: &#39;/usr/bin:/bin:/usr/sbin:/sbin&#39;}

DEBUG util.py:356: Child return code was: 0

DEBUG util.py:316: Executing command: [&#39;/bin/umount&#39;, &#39;-n&#39;, &#39;-l&#39;, &#39;/var/lib/mock/epel-7-x86_64-4888/root/dev/shm&#39;] with env {&#39;LANG&#39;: &#39;en_US.UTF-8&#39;, &#39;TERM&#39;: &#39;vt100&#39;, &#39;SHELL&#39;: &#39;/bin/bash&#39;, &#39;HOSTNAME&#39;: &#39;mock&#39;, &#39;HOME&#39;: &#39;/builddir&#39;, &#39;PATH&#39;: &#39;/usr/bin:/bin:/usr/sbin:/sbin&#39;}

DEBUG util.py:356: Child return code was: 0

DEBUG util.py:316: Executing command: [&#39;/bin/umount&#39;, &#39;-n&#39;, &#39;-l&#39;, &#39;/var/lib/mock/epel-7-x86_64-4888/root/sys&#39;] with env {&#39;LANG&#39;: &#39;en_US.UTF-8&#39;, &#39;TERM&#39;: &#39;vt100&#39;, &#39;SHELL&#39;: &#39;/bin/bash&#39;, &#39;HOSTNAME&#39;: &#39;mock&#39;, &#39;HOME&#39;: &#39;/builddir&#39;, &#39;PATH&#39;: &#39;/usr/bin:/bin:/usr/sbin:/sbin&#39;}

DEBUG util.py:356: Child return code was: 0

DEBUG util.py:316: Executing command: [&#39;/bin/umount&#39;, &#39;-n&#39;, &#39;-l&#39;, &#39;/var/lib/mock/epel-7-x86_64-4888/root/proc&#39;] with env {&#39;LANG&#39;: &#39;en_US.UTF-8&#39;, &#39;TERM&#39;: &#39;vt100&#39;, &#39;SHELL&#39;: &#39;/bin/bash&#39;, &#39;HOSTNAME&#39;: &#39;mock&#39;, &#39;HOME&#39;: &#39;/builddir&#39;, &#39;PATH&#39;: &#39;/usr/bin:/bin:/usr/sbin:/sbin&#39;}

DEBUG util.py:356: Child return code was: 0

INFO backend.py:626: Installed packages:

DEBUG util.py:316: Executing command: rpm --root /var/lib/mock/epel-7-x86_64-4888/root/ -qa with env {&#39;LANG&#39;: &#39;en_US.UTF-8&#39;, &#39;TERM&#39;: &#39;vt100&#39;, &#39;SHELL&#39;: &#39;/bin/bash&#39;, &#39;CCACHE_DIR&#39;: &#39;/tmp/ccache&#39;, &#39;HOSTNAME&#39;: &#39;mock&#39;, &#39;PROMPT_COMMAND&#39;: &#39;echo -n &quot;&lt;mock-chroot&gt;&quot;&#39;, &#39;HOME&#39;: &#39;/builddir&#39;, &#39;PATH&#39;: &#39;/usr/bin:/bin:/usr/sbin:/sbin&#39;, &#39;CCACHE_UMASK&#39;: &#39;002&#39;}

DEBUG util.py:356: Child return code was: 0

DEBUG util.py:316: Executing command: [&#39;/bin/mount&#39;, &#39;-n&#39;, &#39;-t&#39;, &#39;proc&#39;, &#39;proc&#39;, &#39;/var/lib/mock/epel-7-x86_64-4888/root/proc&#39;] with env {&#39;LANG&#39;: &#39;en_US.UTF-8&#39;, &#39;TERM&#39;: &#39;vt100&#39;, &#39;SHELL&#39;: &#39;/bin/bash&#39;, &#39;HOSTNAME&#39;: &#39;mock&#39;, &#39;HOME&#39;: &#39;/builddir&#39;, &#39;PATH&#39;: &#39;/usr/bin:/bin:/usr/sbin:/sbin&#39;}

DEBUG util.py:356: Child return code was: 0

DEBUG util.py:316: Executing command: [&#39;/bin/mount&#39;, &#39;-n&#39;, &#39;-t&#39;, &#39;sysfs&#39;, &#39;mock_chroot_sys&#39;, &#39;/var/lib/mock/epel-7-x86_64-4888/root/sys&#39;] with env {&#39;LANG&#39;: &#39;en_US.UTF-8&#39;, &#39;TERM&#39;: &#39;vt100&#39;, &#39;SHELL&#39;: &#39;/bin/bash&#39;, &#39;HOSTNAME&#39;: &#39;mock&#39;, &#39;HOME&#39;: &#39;/builddir&#39;, &#39;PATH&#39;: &#39;/usr/bin:/bin:/usr/sbin:/sbin&#39;}

DEBUG util.py:356: Child return code was: 0

DEBUG util.py:316: Executing command: [&#39;/bin/mount&#39;, &#39;-n&#39;, &#39;-t&#39;, &#39;tmpfs&#39;, &#39;mock_chroot_shmfs&#39;, &#39;/var/lib/mock/epel-7-x86_64-4888/root/dev/shm&#39;] with env {&#39;LANG&#39;: &#39;en_US.UTF-8&#39;, &#39;TERM&#39;: &#39;vt100&#39;, &#39;SHELL&#39;: &#39;/bin/bash&#39;, &#39;HOSTNAME&#39;: &#39;mock&#39;, &#39;HOME&#39;: &#39;/builddir&#39;, &#39;PATH&#39;: &#39;/usr/bin:/bin:/usr/sbin:/sbin&#39;}

DEBUG util.py:356: Child return code was: 0

DEBUG util.py:316: Executing command: [&#39;/bin/mount&#39;, &#39;-n&#39;, &#39;-t&#39;, &#39;devpts&#39;, &#39;-o&#39;, &#39;gid=5,mode=0620,ptmxmode=0666,newinstance&#39;, &#39;mock_chroot_devpts&#39;, &#39;/var/lib/mock/epel-7-x86_64-4888/root/dev/pts&#39;] with env {&#39;LANG&#39;: &#39;en_US.UTF-8&#39;, &#39;TERM&#39;: &#39;vt100&#39;, &#39;SHELL&#39;: &#39;/bin/bash&#39;, &#39;HOSTNAME&#39;: &#39;mock&#39;, &#39;HOME&#39;: &#39;/builddir&#39;, &#39;PATH&#39;: &#39;/usr/bin:/bin:/usr/sbin:/sbin&#39;}

DEBUG util.py:356: Child return code was: 0

DEBUG util.py:316: Executing command: [&#39;/bin/mount&#39;, &#39;-n&#39;, &#39;--bind&#39;, &#39;/var/cache/mock/epel-7-x86_64/yum_cache/&#39;, &#39;/var/lib/mock/epel-7-x86_64-4888/root/var/cache/yum&#39;] with env {&#39;LANG&#39;: &#39;en_US.UTF-8&#39;, &#39;TERM&#39;: &#39;vt100&#39;, &#39;SHELL&#39;: &#39;/bin/bash&#39;, &#39;HOSTNAME&#39;: &#39;mock&#39;, &#39;HOME&#39;: &#39;/builddir&#39;, &#39;PATH&#39;: &#39;/usr/bin:/bin:/usr/sbin:/sbin&#39;}

DEBUG util.py:356: Child return code was: 0

DEBUG util.py:316: Executing command: [&#39;/bin/mount&#39;, &#39;-n&#39;, &#39;--bind&#39;, &#39;/var/cache/mock/epel-7-x86_64/ccache/&#39;, &#39;/var/lib/mock/epel-7-x86_64-4888/root/tmp/ccache&#39;] with env {&#39;LANG&#39;: &#39;en_US.UTF-8&#39;, &#39;TERM&#39;: &#39;vt100&#39;, &#39;SHELL&#39;: &#39;/bin/bash&#39;, &#39;HOSTNAME&#39;: &#39;mock&#39;, &#39;HOME&#39;: &#39;/builddir&#39;, &#39;PATH&#39;: &#39;/usr/bin:/bin:/usr/sbin:/sbin&#39;}

DEBUG util.py:356: Child return code was: 0

DEBUG util.py:90: remove tree: /var/lib/mock/epel-7-x86_64-4888/root/builddir/build/SOURCES

DEBUG backend.py:855: Copying package to result dir

DEBUG util.py:316: Executing command: [&#39;/bin/umount&#39;, &#39;-n&#39;, &#39;/var/lib/mock/epel-7-x86_64-4888/root/tmp/ccache&#39;] with env {&#39;LANG&#39;: &#39;en_US.UTF-8&#39;, &#39;TERM&#39;: &#39;vt100&#39;, &#39;SHELL&#39;: &#39;/bin/bash&#39;, &#39;HOSTNAME&#39;: &#39;mock&#39;, &#39;HOME&#39;: &#39;/builddir&#39;, &#39;PATH&#39;: &#39;/usr/bin:/bin:/usr/sbin:/sbin&#39;}

DEBUG util.py:356: Child return code was: 0

DEBUG util.py:316: Executing command: [&#39;/bin/umount&#39;, &#39;-n&#39;, &#39;/var/lib/mock/epel-7-x86_64-4888/root/var/cache/yum&#39;] with env {&#39;LANG&#39;: &#39;en_US.UTF-8&#39;, &#39;TERM&#39;: &#39;vt100&#39;, &#39;SHELL&#39;: &#39;/bin/bash&#39;, &#39;HOSTNAME&#39;: &#39;mock&#39;, &#39;HOME&#39;: &#39;/builddir&#39;, &#39;PATH&#39;: &#39;/usr/bin:/bin:/usr/sbin:/sbin&#39;}

DEBUG util.py:356: Child return code was: 0

DEBUG util.py:316: Executing command: [&#39;/bin/umount&#39;, &#39;-n&#39;, &#39;-l&#39;, &#39;/var/lib/mock/epel-7-x86_64-4888/root/dev/pts&#39;] with env {&#39;LANG&#39;: &#39;en_US.UTF-8&#39;, &#39;TERM&#39;: &#39;vt100&#39;, &#39;SHELL&#39;: &#39;/bin/bash&#39;, &#39;HOSTNAME&#39;: &#39;mock&#39;, &#39;HOME&#39;: &#39;/builddir&#39;, &#39;PATH&#39;: &#39;/usr/bin:/bin:/usr/sbin:/sbin&#39;}

DEBUG util.py:356: Child return code was: 0

DEBUG util.py:316: Executing command: [&#39;/bin/umount&#39;, &#39;-n&#39;, &#39;-l&#39;, &#39;/var/lib/mock/epel-7-x86_64-4888/root/dev/shm&#39;] with env {&#39;LANG&#39;: &#39;en_US.UTF-8&#39;, &#39;TERM&#39;: &#39;vt100&#39;, &#39;SHELL&#39;: &#39;/bin/bash&#39;, &#39;HOSTNAME&#39;: &#39;mock&#39;, &#39;HOME&#39;: &#39;/builddir&#39;, &#39;PATH&#39;: &#39;/usr/bin:/bin:/usr/sbin:/sbin&#39;}

DEBUG util.py:356: Child return code was: 0

DEBUG util.py:316: Executing command: [&#39;/bin/umount&#39;, &#39;-n&#39;, &#39;-l&#39;, &#39;/var/lib/mock/epel-7-x86_64-4888/root/sys&#39;] with env {&#39;LANG&#39;: &#39;en_US.UTF-8&#39;, &#39;TERM&#39;: &#39;vt100&#39;, &#39;SHELL&#39;: &#39;/bin/bash&#39;, &#39;HOSTNAME&#39;: &#39;mock&#39;, &#39;HOME&#39;: &#39;/builddir&#39;, &#39;PATH&#39;: &#39;/usr/bin:/bin:/usr/sbin:/sbin&#39;}

DEBUG util.py:356: Child return code was: 0

DEBUG util.py:316: Executing command: [&#39;/bin/umount&#39;, &#39;-n&#39;, &#39;-l&#39;, &#39;/var/lib/mock/epel-7-x86_64-4888/root/proc&#39;] with env {&#39;LANG&#39;: &#39;en_US.UTF-8&#39;, &#39;TERM&#39;: &#39;vt100&#39;, &#39;SHELL&#39;: &#39;/bin/bash&#39;, &#39;HOSTNAME&#39;: &#39;mock&#39;, &#39;HOME&#39;: &#39;/builddir&#39;, &#39;PATH&#39;: &#39;/usr/bin:/bin:/usr/sbin:/sbin&#39;}

DEBUG util.py:356: Child return code was: 0

DEBUG util.py:118: kill orphans

DEBUG util.py:90: remove tree: /var/lib/mock/epel-7-x86_64-4888.tmp

INFO backend.py:220: chroot (/var/lib/mock/epel-7-x86_64-4888) unlocked and deleted

DEBUG util.py:118: kill orphans

INFO backend.py:1016: Mock Version: 1.1.33

DEBUG backend.py:334: rootdir = /var/lib/mock/epel-7-x86_64-4888/root/

DEBUG backend.py:335: resultdir = /tmp/tmpE_0cl1

INFO backend.py:338: calling preinit hooks

DEBUG util.py:64: ensuring that dir exists: /var/cache/mock/epel-7-x86_64/root_cache/

DEBUG util.py:316: Executing command: [&#39;tar&#39;, &#39;--use-compress-program&#39;, &#39;gzip&#39;, &#39;-xf&#39;, &#39;/var/cache/mock/epel-7-x86_64/root_cache/cache.tar.gz&#39;, &#39;-C&#39;, &#39;/var/lib/mock/epel-7-x86_64-4888/root/&#39;] with env {&#39;LANG&#39;: &#39;en_US.UTF-8&#39;, &#39;TERM&#39;: &#39;vt100&#39;, &#39;SHELL&#39;: &#39;/bin/bash&#39;, &#39;HOSTNAME&#39;: &#39;mock&#39;, &#39;HOME&#39;: &#39;/builddir&#39;, &#39;PATH&#39;: &#39;/usr/bin:/bin:/usr/sbin:/sbin&#39;}

DEBUG util.py:356: Child return code was: 0

DEBUG util.py:64: ensuring that dir exists: /var/lib/mock/epel-7-x86_64-4888/root/./proc

DEBUG util.py:67: creating dir: /var/lib/mock/epel-7-x86_64-4888/root/./proc

DEBUG util.py:64: ensuring that dir exists: /var/lib/mock/epel-7-x86_64-4888/root/./sys

DEBUG util.py:67: creating dir: /var/lib/mock/epel-7-x86_64-4888/root/./sys

DEBUG util.py:64: ensuring that dir exists: /var/lib/mock/epel-7-x86_64-4888/root/./dev

DEBUG util.py:67: creating dir: /var/lib/mock/epel-7-x86_64-4888/root/./dev

DEBUG util.py:64: ensuring that dir exists: /var/lib/mock/epel-7-x86_64-4888/root/./tmp/ccache

DEBUG util.py:67: creating dir: /var/lib/mock/epel-7-x86_64-4888/root/./tmp/ccache

DEBUG util.py:64: ensuring that dir exists: /var/lib/mock/epel-7-x86_64-4888/root/./var/cache/yum

DEBUG util.py:67: creating dir: /var/lib/mock/epel-7-x86_64-4888/root/./var/cache/yum

DEBUG util.py:64: ensuring that dir exists: /var/lib/mock/epel-7-x86_64-4888/root/var/cache/yum

DEBUG util.py:64: ensuring that dir exists: /var/lib/mock/epel-7-x86_64-4888/root/tmp/ccache

DEBUG util.py:64: ensuring that dir exists: /var/cache/mock/epel-7-x86_64/ccache/

DEBUG backend.py:505: create skeleton dirs

DEBUG util.py:64: ensuring that dir exists: /var/lib/mock/epel-7-x86_64-4888/root/var/lib/rpm

DEBUG util.py:64: ensuring that dir exists: /var/lib/mock/epel-7-x86_64-4888/root/var/lib/yum

DEBUG util.py:64: ensuring that dir exists: /var/lib/mock/epel-7-x86_64-4888/root/var/lib/dbus

DEBUG util.py:64: ensuring that dir exists: /var/lib/mock/epel-7-x86_64-4888/root/var/log

DEBUG util.py:64: ensuring that dir exists: /var/lib/mock/epel-7-x86_64-4888/root/var/cache/yum

DEBUG util.py:64: ensuring that dir exists: /var/lib/mock/epel-7-x86_64-4888/root/etc/rpm

DEBUG util.py:64: ensuring that dir exists: /var/lib/mock/epel-7-x86_64-4888/root/tmp

DEBUG util.py:64: ensuring that dir exists: /var/lib/mock/epel-7-x86_64-4888/root/tmp/ccache

DEBUG util.py:64: ensuring that dir exists: /var/lib/mock/epel-7-x86_64-4888/root/var/tmp

DEBUG util.py:64: ensuring that dir exists: /var/lib/mock/epel-7-x86_64-4888/root/etc/yum.repos.d

DEBUG util.py:64: ensuring that dir exists: /var/lib/mock/epel-7-x86_64-4888/root/etc/yum

DEBUG util.py:64: ensuring that dir exists: /var/lib/mock/epel-7-x86_64-4888/root/proc

DEBUG util.py:64: ensuring that dir exists: /var/lib/mock/epel-7-x86_64-4888/root/sys

DEBUG backend.py:526: touch required files

DEBUG util.py:75: touching file: /var/lib/mock/epel-7-x86_64-4888/root/etc/mtab

DEBUG util.py:75: touching file: /var/lib/mock/epel-7-x86_64-4888/root/etc/fstab

DEBUG util.py:75: touching file: /var/lib/mock/epel-7-x86_64-4888/root/var/log/yum.log

DEBUG backend.py:353: configure yum

DEBUG backend.py:368: configure yum priorities

DEBUG util.py:64: ensuring that dir exists: /var/lib/mock/epel-7-x86_64-4888/root/etc/yum/pluginconf.d

DEBUG backend.py:377: configure yum rhnplugin

DEBUG util.py:64: ensuring that dir exists: /var/lib/mock/epel-7-x86_64-4888/root/etc/yum/pluginconf.d

DEBUG util.py:90: remove tree: /var/lib/mock/epel-7-x86_64-4888/root/dev

DEBUG util.py:64: ensuring that dir exists: /var/lib/mock/epel-7-x86_64-4888/root/dev/pts

DEBUG util.py:67: creating dir: /var/lib/mock/epel-7-x86_64-4888/root/dev/pts

DEBUG util.py:64: ensuring that dir exists: /var/lib/mock/epel-7-x86_64-4888/root/dev/shm

DEBUG util.py:67: creating dir: /var/lib/mock/epel-7-x86_64-4888/root/dev/shm

DEBUG backend.py:472: kver == 3.16.0-4-amd64

DEBUG util.py:316: Executing command: [&#39;/bin/mount&#39;, &#39;-n&#39;, &#39;-t&#39;, &#39;proc&#39;, &#39;proc&#39;, &#39;/var/lib/mock/epel-7-x86_64-4888/root/proc&#39;] with env {&#39;LANG&#39;: &#39;en_US.UTF-8&#39;, &#39;TERM&#39;: &#39;vt100&#39;, &#39;SHELL&#39;: &#39;/bin/bash&#39;, &#39;HOSTNAME&#39;: &#39;mock&#39;, &#39;HOME&#39;: &#39;/builddir&#39;, &#39;PATH&#39;: &#39;/usr/bin:/bin:/usr/sbin:/sbin&#39;}

DEBUG util.py:356: Child return code was: 0

DEBUG util.py:316: Executing command: [&#39;/bin/mount&#39;, &#39;-n&#39;, &#39;-t&#39;, &#39;sysfs&#39;, &#39;mock_chroot_sys&#39;, &#39;/var/lib/mock/epel-7-x86_64-4888/root/sys&#39;] with env {&#39;LANG&#39;: &#39;en_US.UTF-8&#39;, &#39;TERM&#39;: &#39;vt100&#39;, &#39;SHELL&#39;: &#39;/bin/bash&#39;, &#39;HOSTNAME&#39;: &#39;mock&#39;, &#39;HOME&#39;: &#39;/builddir&#39;, &#39;PATH&#39;: &#39;/usr/bin:/bin:/usr/sbin:/sbin&#39;}

DEBUG util.py:356: Child return code was: 0

DEBUG util.py:316: Executing command: [&#39;/bin/mount&#39;, &#39;-n&#39;, &#39;-t&#39;, &#39;tmpfs&#39;, &#39;mock_chroot_shmfs&#39;, &#39;/var/lib/mock/epel-7-x86_64-4888/root/dev/shm&#39;] with env {&#39;LANG&#39;: &#39;en_US.UTF-8&#39;, &#39;TERM&#39;: &#39;vt100&#39;, &#39;SHELL&#39;: &#39;/bin/bash&#39;, &#39;HOSTNAME&#39;: &#39;mock&#39;, &#39;HOME&#39;: &#39;/builddir&#39;, &#39;PATH&#39;: &#39;/usr/bin:/bin:/usr/sbin:/sbin&#39;}

DEBUG util.py:356: Child return code was: 0

DEBUG util.py:316: Executing command: [&#39;/bin/mount&#39;, &#39;-n&#39;, &#39;-t&#39;, &#39;devpts&#39;, &#39;-o&#39;, &#39;gid=5,mode=0620,ptmxmode=0666,newinstance&#39;, &#39;mock_chroot_devpts&#39;, &#39;/var/lib/mock/epel-7-x86_64-4888/root/dev/pts&#39;] with env {&#39;LANG&#39;: &#39;en_US.UTF-8&#39;, &#39;TERM&#39;: &#39;vt100&#39;, &#39;SHELL&#39;: &#39;/bin/bash&#39;, &#39;HOSTNAME&#39;: &#39;mock&#39;, &#39;HOME&#39;: &#39;/builddir&#39;, &#39;PATH&#39;: &#39;/usr/bin:/bin:/usr/sbin:/sbin&#39;}

DEBUG util.py:356: Child return code was: 0

DEBUG util.py:316: Executing command: [&#39;/bin/mount&#39;, &#39;-n&#39;, &#39;--bind&#39;, &#39;/var/cache/mock/epel-7-x86_64/yum_cache/&#39;, &#39;/var/lib/mock/epel-7-x86_64-4888/root/var/cache/yum&#39;] with env {&#39;LANG&#39;: &#39;en_US.UTF-8&#39;, &#39;TERM&#39;: &#39;vt100&#39;, &#39;SHELL&#39;: &#39;/bin/bash&#39;, &#39;HOSTNAME&#39;: &#39;mock&#39;, &#39;HOME&#39;: &#39;/builddir&#39;, &#39;PATH&#39;: &#39;/usr/bin:/bin:/usr/sbin:/sbin&#39;}

DEBUG util.py:356: Child return code was: 0

DEBUG util.py:316: Executing command: [&#39;/bin/mount&#39;, &#39;-n&#39;, &#39;--bind&#39;, &#39;/var/cache/mock/epel-7-x86_64/ccache/&#39;, &#39;/var/lib/mock/epel-7-x86_64-4888/root/tmp/ccache&#39;] with env {&#39;LANG&#39;: &#39;en_US.UTF-8&#39;, &#39;TERM&#39;: &#39;vt100&#39;, &#39;SHELL&#39;: &#39;/bin/bash&#39;, &#39;HOSTNAME&#39;: &#39;mock&#39;, &#39;HOME&#39;: &#39;/builddir&#39;, &#39;PATH&#39;: &#39;/usr/bin:/bin:/usr/sbin:/sbin&#39;}

DEBUG util.py:356: Child return code was: 0

DEBUG backend.py:947: [&#39;/usr/bin/yum&#39;, &#39;--installroot&#39;, &#39;/var/lib/mock/epel-7-x86_64-4888/root/&#39;, &#39;update&#39;]

DEBUG util.py:316: Executing command: [&#39;/usr/bin/yum&#39;, &#39;--installroot&#39;, &#39;/var/lib/mock/epel-7-x86_64-4888/root/&#39;, &#39;update&#39;] with env {&#39;LANG&#39;: &#39;en_US.UTF-8&#39;, &#39;TERM&#39;: &#39;vt100&#39;, &#39;SHELL&#39;: &#39;/bin/bash&#39;, &#39;CCACHE_DIR&#39;: &#39;/tmp/ccache&#39;, &#39;HOSTNAME&#39;: &#39;mock&#39;, &#39;PROMPT_COMMAND&#39;: &#39;echo -n &quot;&lt;mock-chroot&gt;&quot;&#39;, &#39;HOME&#39;: &#39;/builddir&#39;, &#39;PATH&#39;: &#39;/usr/bin:/bin:/usr/sbin:/sbin&#39;, &#39;CCACHE_UMASK&#39;: &#39;002&#39;}

DEBUG util.py:266: Setting up Update Process

DEBUG util.py:266: No Packages marked for Update

DEBUG util.py:356: Child return code was: 0

DEBUG util.py:316: Executing command: /usr/bin/repoquery -c /var/lib/mock/epel-7-x86_64-4888/root//etc/yum.conf -a --qf &#39;%{nevra} %{buildtime} %{size} %{pkgid} %{repoid}&#39; &gt; /tmp/tmpE_0cl1/available_pkgs with env {&#39;LANG&#39;: &#39;en_US.UTF-8&#39;, &#39;TERM&#39;: &#39;vt100&#39;, &#39;SHELL&#39;: &#39;/bin/bash&#39;, &#39;HOSTNAME&#39;: &#39;mock&#39;, &#39;HOME&#39;: &#39;/builddir&#39;, &#39;PATH&#39;: &#39;/usr/bin:/bin:/usr/sbin:/sbin&#39;}

DEBUG util.py:266: Not using downloaded repomd.xml because it is older than what we have:

DEBUG util.py:266: Current : Sun May 22 07:52:33 2016

DEBUG util.py:266: Downloaded: Wed Dec 9 23:35:45 2015

DEBUG util.py:266: Not using downloaded repomd.xml because it is older than what we have:

DEBUG util.py:266: Current : Thu Nov 17 05:49:36 2016

DEBUG util.py:266: Downloaded: Wed Nov 16 23:59:35 2016

DEBUG util.py:266: Not using downloaded repomd.xml because it is older than what we have:

DEBUG util.py:266: Current : Sat Nov 12 07:48:25 2016

DEBUG util.py:266: Downloaded: Tue Oct 25 12:47:15 2016

DEBUG util.py:356: Child return code was: 0

DEBUG util.py:90: remove tree: /var/lib/mock/epel-7-x86_64-4888/root/builddir

DEBUG util.py:316: Executing command: [&#39;/usr/sbin/userdel&#39;, &#39;-r&#39;, &#39;-f&#39;, &#39;mockbuild&#39;] with env {&#39;LANG&#39;: &#39;en_US.UTF-8&#39;, &#39;TERM&#39;: &#39;vt100&#39;, &#39;SHELL&#39;: &#39;/bin/bash&#39;, &#39;CCACHE_DIR&#39;: &#39;/tmp/ccache&#39;, &#39;HOSTNAME&#39;: &#39;mock&#39;, &#39;PROMPT_COMMAND&#39;: &#39;echo -n &quot;&lt;mock-chroot&gt;&quot;&#39;, &#39;HOME&#39;: &#39;/builddir&#39;, &#39;PATH&#39;: &#39;/usr/bin:/bin:/usr/sbin:/sbin&#39;, &#39;CCACHE_UMASK&#39;: &#39;002&#39;}

DEBUG util.py:266: userdel: mockbuild home directory (/builddir) not found

DEBUG util.py:356: Child return code was: 0

DEBUG util.py:316: Executing command: [&#39;/usr/sbin/groupdel&#39;, &#39;mockbuild&#39;] with env {&#39;LANG&#39;: &#39;en_US.UTF-8&#39;, &#39;TERM&#39;: &#39;vt100&#39;, &#39;SHELL&#39;: &#39;/bin/bash&#39;, &#39;CCACHE_DIR&#39;: &#39;/tmp/ccache&#39;, &#39;HOSTNAME&#39;: &#39;mock&#39;, &#39;PROMPT_COMMAND&#39;: &#39;echo -n &quot;&lt;mock-chroot&gt;&quot;&#39;, &#39;HOME&#39;: &#39;/builddir&#39;, &#39;PATH&#39;: &#39;/usr/bin:/bin:/usr/sbin:/sbin&#39;, &#39;CCACHE_UMASK&#39;: &#39;002&#39;}

DEBUG util.py:266: groupdel: group &#39;mockbuild&#39; does not exist

DEBUG util.py:356: Child return code was: 6

DEBUG util.py:316: Executing command: [&#39;/usr/sbin/groupadd&#39;, &#39;-g&#39;, &#39;122&#39;, &#39;mockbuild&#39;] with env {&#39;LANG&#39;: &#39;en_US.UTF-8&#39;, &#39;TERM&#39;: &#39;vt100&#39;, &#39;SHELL&#39;: &#39;/bin/bash&#39;, &#39;CCACHE_DIR&#39;: &#39;/tmp/ccache&#39;, &#39;HOSTNAME&#39;: &#39;mock&#39;, &#39;PROMPT_COMMAND&#39;: &#39;echo -n &quot;&lt;mock-chroot&gt;&quot;&#39;, &#39;HOME&#39;: &#39;/builddir&#39;, &#39;PATH&#39;: &#39;/usr/bin:/bin:/usr/sbin:/sbin&#39;, &#39;CCACHE_UMASK&#39;: &#39;002&#39;}

DEBUG util.py:356: Child return code was: 0

DEBUG util.py:316: Executing command: /usr/sbin/useradd -o -m -u 111 -g 122 -d /builddir -n mockbuild with env {&#39;LANG&#39;: &#39;en_US.UTF-8&#39;, &#39;TERM&#39;: &#39;vt100&#39;, &#39;SHELL&#39;: &#39;/bin/bash&#39;, &#39;CCACHE_DIR&#39;: &#39;/tmp/ccache&#39;, &#39;HOSTNAME&#39;: &#39;mock&#39;, &#39;PROMPT_COMMAND&#39;: &#39;echo -n &quot;&lt;mock-chroot&gt;&quot;&#39;, &#39;HOME&#39;: &#39;/builddir&#39;, &#39;PATH&#39;: &#39;/usr/bin:/bin:/usr/sbin:/sbin&#39;, &#39;CCACHE_UMASK&#39;: &#39;002&#39;}

DEBUG util.py:356: Child return code was: 0

DEBUG util.py:64: ensuring that dir exists: /var/lib/mock/epel-7-x86_64-4888/root/builddir/build/RPMS

DEBUG util.py:67: creating dir: /var/lib/mock/epel-7-x86_64-4888/root/builddir/build/RPMS

DEBUG util.py:64: ensuring that dir exists: /var/lib/mock/epel-7-x86_64-4888/root/builddir/build/SRPMS

DEBUG util.py:67: creating dir: /var/lib/mock/epel-7-x86_64-4888/root/builddir/build/SRPMS

DEBUG util.py:64: ensuring that dir exists: /var/lib/mock/epel-7-x86_64-4888/root/builddir/build/SOURCES

DEBUG util.py:67: creating dir: /var/lib/mock/epel-7-x86_64-4888/root/builddir/build/SOURCES

DEBUG util.py:64: ensuring that dir exists: /var/lib/mock/epel-7-x86_64-4888/root/builddir/build/SPECS

DEBUG util.py:67: creating dir: /var/lib/mock/epel-7-x86_64-4888/root/builddir/build/SPECS

DEBUG util.py:64: ensuring that dir exists: /var/lib/mock/epel-7-x86_64-4888/root/builddir/build/BUILD

DEBUG util.py:67: creating dir: /var/lib/mock/epel-7-x86_64-4888/root/builddir/build/BUILD

DEBUG util.py:64: ensuring that dir exists: /var/lib/mock/epel-7-x86_64-4888/root/builddir/build/BUILDROOT

DEBUG util.py:67: creating dir: /var/lib/mock/epel-7-x86_64-4888/root/builddir/build/BUILDROOT

DEBUG util.py:64: ensuring that dir exists: /var/lib/mock/epel-7-x86_64-4888/root/builddir/build/originals

DEBUG util.py:67: creating dir: /var/lib/mock/epel-7-x86_64-4888/root/builddir/build/originals

DEBUG util.py:316: Executing command: [&#39;/bin/umount&#39;, &#39;-n&#39;, &#39;/var/lib/mock/epel-7-x86_64-4888/root/tmp/ccache&#39;] with env {&#39;LANG&#39;: &#39;en_US.UTF-8&#39;, &#39;TERM&#39;: &#39;vt100&#39;, &#39;SHELL&#39;: &#39;/bin/bash&#39;, &#39;HOSTNAME&#39;: &#39;mock&#39;, &#39;HOME&#39;: &#39;/builddir&#39;, &#39;PATH&#39;: &#39;/usr/bin:/bin:/usr/sbin:/sbin&#39;}

DEBUG util.py:356: Child return code was: 0

DEBUG util.py:316: Executing command: [&#39;/bin/umount&#39;, &#39;-n&#39;, &#39;/var/lib/mock/epel-7-x86_64-4888/root/var/cache/yum&#39;] with env {&#39;LANG&#39;: &#39;en_US.UTF-8&#39;, &#39;TERM&#39;: &#39;vt100&#39;, &#39;SHELL&#39;: &#39;/bin/bash&#39;, &#39;HOSTNAME&#39;: &#39;mock&#39;, &#39;HOME&#39;: &#39;/builddir&#39;, &#39;PATH&#39;: &#39;/usr/bin:/bin:/usr/sbin:/sbin&#39;}

DEBUG util.py:356: Child return code was: 0

DEBUG util.py:316: Executing command: [&#39;/bin/umount&#39;, &#39;-n&#39;, &#39;-l&#39;, &#39;/var/lib/mock/epel-7-x86_64-4888/root/dev/pts&#39;] with env {&#39;LANG&#39;: &#39;en_US.UTF-8&#39;, &#39;TERM&#39;: &#39;vt100&#39;, &#39;SHELL&#39;: &#39;/bin/bash&#39;, &#39;HOSTNAME&#39;: &#39;mock&#39;, &#39;HOME&#39;: &#39;/builddir&#39;, &#39;PATH&#39;: &#39;/usr/bin:/bin:/usr/sbin:/sbin&#39;}

DEBUG util.py:356: Child return code was: 0

DEBUG util.py:316: Executing command: [&#39;/bin/umount&#39;, &#39;-n&#39;, &#39;-l&#39;, &#39;/var/lib/mock/epel-7-x86_64-4888/root/dev/shm&#39;] with env {&#39;LANG&#39;: &#39;en_US.UTF-8&#39;, &#39;TERM&#39;: &#39;vt100&#39;, &#39;SHELL&#39;: &#39;/bin/bash&#39;, &#39;HOSTNAME&#39;: &#39;mock&#39;, &#39;HOME&#39;: &#39;/builddir&#39;, &#39;PATH&#39;: &#39;/usr/bin:/bin:/usr/sbin:/sbin&#39;}

DEBUG util.py:356: Child return code was: 0

DEBUG util.py:316: Executing command: [&#39;/bin/umount&#39;, &#39;-n&#39;, &#39;-l&#39;, &#39;/var/lib/mock/epel-7-x86_64-4888/root/sys&#39;] with env {&#39;LANG&#39;: &#39;en_US.UTF-8&#39;, &#39;TERM&#39;: &#39;vt100&#39;, &#39;SHELL&#39;: &#39;/bin/bash&#39;, &#39;HOSTNAME&#39;: &#39;mock&#39;, &#39;HOME&#39;: &#39;/builddir&#39;, &#39;PATH&#39;: &#39;/usr/bin:/bin:/usr/sbin:/sbin&#39;}

DEBUG util.py:356: Child return code was: 0

DEBUG util.py:316: Executing command: [&#39;/bin/umount&#39;, &#39;-n&#39;, &#39;-l&#39;, &#39;/var/lib/mock/epel-7-x86_64-4888/root/proc&#39;] with env {&#39;LANG&#39;: &#39;en_US.UTF-8&#39;, &#39;TERM&#39;: &#39;vt100&#39;, &#39;SHELL&#39;: &#39;/bin/bash&#39;, &#39;HOSTNAME&#39;: &#39;mock&#39;, &#39;HOME&#39;: &#39;/builddir&#39;, &#39;PATH&#39;: &#39;/usr/bin:/bin:/usr/sbin:/sbin&#39;}

DEBUG util.py:356: Child return code was: 0

INFO backend.py:626: Installed packages:

DEBUG util.py:316: Executing command: rpm --root /var/lib/mock/epel-7-x86_64-4888/root/ -qa with env {&#39;LANG&#39;: &#39;en_US.UTF-8&#39;, &#39;TERM&#39;: &#39;vt100&#39;, &#39;SHELL&#39;: &#39;/bin/bash&#39;, &#39;CCACHE_DIR&#39;: &#39;/tmp/ccache&#39;, &#39;HOSTNAME&#39;: &#39;mock&#39;, &#39;PROMPT_COMMAND&#39;: &#39;echo -n &quot;&lt;mock-chroot&gt;&quot;&#39;, &#39;HOME&#39;: &#39;/builddir&#39;, &#39;PATH&#39;: &#39;/usr/bin:/bin:/usr/sbin:/sbin&#39;, &#39;CCACHE_UMASK&#39;: &#39;002&#39;}

DEBUG util.py:356: Child return code was: 0

DEBUG util.py:90: remove tree: /var/lib/mock/epel-7-x86_64-4888/root/dev

DEBUG util.py:64: ensuring that dir exists: /var/lib/mock/epel-7-x86_64-4888/root/dev/pts

DEBUG util.py:67: creating dir: /var/lib/mock/epel-7-x86_64-4888/root/dev/pts

DEBUG util.py:64: ensuring that dir exists: /var/lib/mock/epel-7-x86_64-4888/root/dev/shm

DEBUG util.py:67: creating dir: /var/lib/mock/epel-7-x86_64-4888/root/dev/shm

DEBUG backend.py:472: kver == 3.16.0-4-amd64

DEBUG util.py:316: Executing command: [&#39;/bin/mount&#39;, &#39;-n&#39;, &#39;-t&#39;, &#39;proc&#39;, &#39;proc&#39;, &#39;/var/lib/mock/epel-7-x86_64-4888/root/proc&#39;] with env {&#39;LANG&#39;: &#39;en_US.UTF-8&#39;, &#39;TERM&#39;: &#39;vt100&#39;, &#39;SHELL&#39;: &#39;/bin/bash&#39;, &#39;HOSTNAME&#39;: &#39;mock&#39;, &#39;HOME&#39;: &#39;/builddir&#39;, &#39;PATH&#39;: &#39;/usr/bin:/bin:/usr/sbin:/sbin&#39;}

DEBUG util.py:356: Child return code was: 0

DEBUG util.py:316: Executing command: [&#39;/bin/mount&#39;, &#39;-n&#39;, &#39;-t&#39;, &#39;sysfs&#39;, &#39;mock_chroot_sys&#39;, &#39;/var/lib/mock/epel-7-x86_64-4888/root/sys&#39;] with env {&#39;LANG&#39;: &#39;en_US.UTF-8&#39;, &#39;TERM&#39;: &#39;vt100&#39;, &#39;SHELL&#39;: &#39;/bin/bash&#39;, &#39;HOSTNAME&#39;: &#39;mock&#39;, &#39;HOME&#39;: &#39;/builddir&#39;, &#39;PATH&#39;: &#39;/usr/bin:/bin:/usr/sbin:/sbin&#39;}

DEBUG util.py:356: Child return code was: 0

DEBUG util.py:316: Executing command: [&#39;/bin/mount&#39;, &#39;-n&#39;, &#39;-t&#39;, &#39;tmpfs&#39;, &#39;mock_chroot_shmfs&#39;, &#39;/var/lib/mock/epel-7-x86_64-4888/root/dev/shm&#39;] with env {&#39;LANG&#39;: &#39;en_US.UTF-8&#39;, &#39;TERM&#39;: &#39;vt100&#39;, &#39;SHELL&#39;: &#39;/bin/bash&#39;, &#39;HOSTNAME&#39;: &#39;mock&#39;, &#39;HOME&#39;: &#39;/builddir&#39;, &#39;PATH&#39;: &#39;/usr/bin:/bin:/usr/sbin:/sbin&#39;}

DEBUG util.py:356: Child return code was: 0

DEBUG util.py:316: Executing command: [&#39;/bin/mount&#39;, &#39;-n&#39;, &#39;-t&#39;, &#39;devpts&#39;, &#39;-o&#39;, &#39;gid=5,mode=0620,ptmxmode=0666,newinstance&#39;, &#39;mock_chroot_devpts&#39;, &#39;/var/lib/mock/epel-7-x86_64-4888/root/dev/pts&#39;] with env {&#39;LANG&#39;: &#39;en_US.UTF-8&#39;, &#39;TERM&#39;: &#39;vt100&#39;, &#39;SHELL&#39;: &#39;/bin/bash&#39;, &#39;HOSTNAME&#39;: &#39;mock&#39;, &#39;HOME&#39;: &#39;/builddir&#39;, &#39;PATH&#39;: &#39;/usr/bin:/bin:/usr/sbin:/sbin&#39;}

DEBUG util.py:356: Child return code was: 0

DEBUG util.py:316: Executing command: [&#39;/bin/mount&#39;, &#39;-n&#39;, &#39;--bind&#39;, &#39;/var/cache/mock/epel-7-x86_64/yum_cache/&#39;, &#39;/var/lib/mock/epel-7-x86_64-4888/root/var/cache/yum&#39;] with env {&#39;LANG&#39;: &#39;en_US.UTF-8&#39;, &#39;TERM&#39;: &#39;vt100&#39;, &#39;SHELL&#39;: &#39;/bin/bash&#39;, &#39;HOSTNAME&#39;: &#39;mock&#39;, &#39;HOME&#39;: &#39;/builddir&#39;, &#39;PATH&#39;: &#39;/usr/bin:/bin:/usr/sbin:/sbin&#39;}

DEBUG util.py:356: Child return code was: 0

DEBUG util.py:316: Executing command: [&#39;/bin/mount&#39;, &#39;-n&#39;, &#39;--bind&#39;, &#39;/var/cache/mock/epel-7-x86_64/ccache/&#39;, &#39;/var/lib/mock/epel-7-x86_64-4888/root/tmp/ccache&#39;] with env {&#39;LANG&#39;: &#39;en_US.UTF-8&#39;, &#39;TERM&#39;: &#39;vt100&#39;, &#39;SHELL&#39;: &#39;/bin/bash&#39;, &#39;HOSTNAME&#39;: &#39;mock&#39;, &#39;HOME&#39;: &#39;/builddir&#39;, &#39;PATH&#39;: &#39;/usr/bin:/bin:/usr/sbin:/sbin&#39;}

DEBUG util.py:356: Child return code was: 0

DEBUG util.py:316: Executing command: [&#39;rpm&#39;, &#39;-Uvh&#39;, &#39;--nodeps&#39;, &#39;/builddir/build/originals/python-logilab-common-1.3.0-logilab.1.el7.centos~revf3ab15166db9.src.rpm&#39;] with env {&#39;LANG&#39;: &#39;en_US.UTF-8&#39;, &#39;TERM&#39;: &#39;vt100&#39;, &#39;SHELL&#39;: &#39;/bin/bash&#39;, &#39;CCACHE_DIR&#39;: &#39;/tmp/ccache&#39;, &#39;HOSTNAME&#39;: &#39;mock&#39;, &#39;PROMPT_COMMAND&#39;: &#39;echo -n &quot;&lt;mock-chroot&gt;&quot;&#39;, &#39;HOME&#39;: &#39;/builddir&#39;, &#39;PATH&#39;: &#39;/usr/bin:/bin:/usr/sbin:/sbin&#39;, &#39;CCACHE_UMASK&#39;: &#39;002&#39;}

DEBUG util.py:266: error: cannot open Packages index using db5 - Permission denied (13)

DEBUG util.py:266: error: cannot open Packages database in /var/lib/rpm

DEBUG util.py:266: Updating / installing...

DEBUG util.py:266: python-logilab-common-1.3.0-logilab.1.########################################

DEBUG util.py:356: Child return code was: 0

DEBUG backend.py:947: [&#39;/usr/bin/yum&#39;, &#39;--installroot&#39;, &#39;/var/lib/mock/epel-7-x86_64-4888/root/&#39;, &#39;resolvedep&#39;, &#39;ccache&#39;]

DEBUG util.py:316: Executing command: [&#39;/usr/bin/yum&#39;, &#39;--installroot&#39;, &#39;/var/lib/mock/epel-7-x86_64-4888/root/&#39;, &#39;resolvedep&#39;, &#39;ccache&#39;] with env {&#39;LANG&#39;: &#39;en_US.UTF-8&#39;, &#39;TERM&#39;: &#39;vt100&#39;, &#39;SHELL&#39;: &#39;/bin/bash&#39;, &#39;CCACHE_DIR&#39;: &#39;/tmp/ccache&#39;, &#39;HOSTNAME&#39;: &#39;mock&#39;, &#39;PROMPT_COMMAND&#39;: &#39;echo -n &quot;&lt;mock-chroot&gt;&quot;&#39;, &#39;HOME&#39;: &#39;/builddir&#39;, &#39;PATH&#39;: &#39;/usr/bin:/bin:/usr/sbin:/sbin&#39;, &#39;CCACHE_UMASK&#39;: &#39;002&#39;}

DEBUG util.py:266: 0:ccache-3.2.7-3.el7.x86_64

DEBUG util.py:356: Child return code was: 0

DEBUG backend.py:947: [&#39;/usr/bin/yum&#39;, &#39;--installroot&#39;, &#39;/var/lib/mock/epel-7-x86_64-4888/root/&#39;, &#39;install&#39;, &#39;ccache&#39;]

DEBUG util.py:316: Executing command: [&#39;/usr/bin/yum&#39;, &#39;--installroot&#39;, &#39;/var/lib/mock/epel-7-x86_64-4888/root/&#39;, &#39;install&#39;, &#39;ccache&#39;] with env {&#39;LANG&#39;: &#39;en_US.UTF-8&#39;, &#39;TERM&#39;: &#39;vt100&#39;, &#39;SHELL&#39;: &#39;/bin/bash&#39;, &#39;CCACHE_DIR&#39;: &#39;/tmp/ccache&#39;, &#39;HOSTNAME&#39;: &#39;mock&#39;, &#39;PROMPT_COMMAND&#39;: &#39;echo -n &quot;&lt;mock-chroot&gt;&quot;&#39;, &#39;HOME&#39;: &#39;/builddir&#39;, &#39;PATH&#39;: &#39;/usr/bin:/bin:/usr/sbin:/sbin&#39;, &#39;CCACHE_UMASK&#39;: &#39;002&#39;}

DEBUG util.py:266: Setting up Install Process

DEBUG util.py:266: Resolving Dependencies

DEBUG util.py:266: --&gt; Running transaction check

DEBUG util.py:266: ---&gt; Package ccache.x86_64 0:3.2.7-3.el7 will be installed

DEBUG util.py:266: --&gt; Processing Dependency: shadow-utils for package: ccache-3.2.7-3.el7.x86_64

DEBUG util.py:266: --&gt; Processing Dependency: rtld(GNU_HASH) for package: ccache-3.2.7-3.el7.x86_64

DEBUG util.py:266: --&gt; Processing Dependency: libm.so.6(GLIBC_2.2.5)(64bit) for package: ccache-3.2.7-3.el7.x86_64

DEBUG util.py:266: --&gt; Processing Dependency: libc.so.6(GLIBC_2.14)(64bit) for package: ccache-3.2.7-3.el7.x86_64

DEBUG util.py:266: --&gt; Processing Dependency: coreutils for package: ccache-3.2.7-3.el7.x86_64

DEBUG util.py:266: --&gt; Processing Dependency: /bin/sh for package: ccache-3.2.7-3.el7.x86_64

DEBUG util.py:266: --&gt; Processing Dependency: /bin/sh for package: ccache-3.2.7-3.el7.x86_64

DEBUG util.py:266: --&gt; Processing Dependency: libz.so.1()(64bit) for package: ccache-3.2.7-3.el7.x86_64

DEBUG util.py:266: --&gt; Processing Dependency: libm.so.6()(64bit) for package: ccache-3.2.7-3.el7.x86_64

DEBUG util.py:266: --&gt; Running transaction check

DEBUG util.py:266: ---&gt; Package bash.x86_64 0:4.2.46-20.el7_2 will be installed

DEBUG util.py:266: --&gt; Processing Dependency: libtinfo.so.5()(64bit) for package: bash-4.2.46-20.el7_2.x86_64

DEBUG util.py:266: ---&gt; Package coreutils.x86_64 0:8.22-15.el7_2.1 will be installed

DEBUG util.py:266: --&gt; Processing Dependency: ncurses for package: coreutils-8.22-15.el7_2.1.x86_64

DEBUG util.py:266: --&gt; Processing Dependency: libcrypto.so.10(libcrypto.so.10)(64bit) for package: coreutils-8.22-15.el7_2.1.x86_64

DEBUG util.py:266: --&gt; Processing Dependency: libattr.so.1(ATTR_1.1)(64bit) for package: coreutils-8.22-15.el7_2.1.x86_64

DEBUG util.py:266: --&gt; Processing Dependency: libacl.so.1(ACL_1.0)(64bit) for package: coreutils-8.22-15.el7_2.1.x86_64

DEBUG util.py:266: --&gt; Processing Dependency: grep for package: coreutils-8.22-15.el7_2.1.x86_64

DEBUG util.py:266: --&gt; Processing Dependency: gmp for package: coreutils-8.22-15.el7_2.1.x86_64

DEBUG util.py:266: --&gt; Processing Dependency: /sbin/install-info for package: coreutils-8.22-15.el7_2.1.x86_64

DEBUG util.py:266: --&gt; Processing Dependency: /sbin/install-info for package: coreutils-8.22-15.el7_2.1.x86_64

DEBUG util.py:266: --&gt; Processing Dependency: libselinux.so.1()(64bit) for package: coreutils-8.22-15.el7_2.1.x86_64

DEBUG util.py:266: --&gt; Processing Dependency: libgmp.so.10()(64bit) for package: coreutils-8.22-15.el7_2.1.x86_64

DEBUG util.py:266: --&gt; Processing Dependency: libcrypto.so.10()(64bit) for package: coreutils-8.22-15.el7_2.1.x86_64

DEBUG util.py:266: --&gt; Processing Dependency: libcap.so.2()(64bit) for package: coreutils-8.22-15.el7_2.1.x86_64

DEBUG util.py:266: --&gt; Processing Dependency: libattr.so.1()(64bit) for package: coreutils-8.22-15.el7_2.1.x86_64

DEBUG util.py:266: --&gt; Processing Dependency: libacl.so.1()(64bit) for package: coreutils-8.22-15.el7_2.1.x86_64

DEBUG util.py:266: ---&gt; Package glibc.x86_64 0:2.17-106.el7_2.8 will be installed

DEBUG util.py:266: --&gt; Processing Dependency: glibc-common = 2.17-106.el7_2.8 for package: glibc-2.17-106.el7_2.8.x86_64

DEBUG util.py:266: --&gt; Processing Dependency: libgcc for package: glibc-2.17-106.el7_2.8.x86_64

DEBUG util.py:266: --&gt; Processing Dependency: libfreebl3.so(NSSRAWHASH_3.12.3)(64bit) for package: glibc-2.17-106.el7_2.8.x86_64

DEBUG util.py:266: --&gt; Processing Dependency: basesystem for package: glibc-2.17-106.el7_2.8.x86_64

DEBUG util.py:266: --&gt; Processing Dependency: libfreebl3.so()(64bit) for package: glibc-2.17-106.el7_2.8.x86_64

DEBUG util.py:266: ---&gt; Package shadow-utils.x86_64 2:4.1.5.1-18.el7 will be installed

DEBUG util.py:266: --&gt; Processing Dependency: audit-libs &gt;= 1.6.5 for package: 2:shadow-utils-4.1.5.1-18.el7.x86_64

DEBUG util.py:266: --&gt; Processing Dependency: setup for package: 2:shadow-utils-4.1.5.1-18.el7.x86_64

DEBUG util.py:266: --&gt; Processing Dependency: libsemanage.so.1(LIBSEMANAGE_1.0)(64bit) for package: 2:shadow-utils-4.1.5.1-18.el7.x86_64

DEBUG util.py:266: --&gt; Processing Dependency: libsemanage.so.1()(64bit) for package: 2:shadow-utils-4.1.5.1-18.el7.x86_64

DEBUG util.py:266: --&gt; Processing Dependency: libaudit.so.1()(64bit) for package: 2:shadow-utils-4.1.5.1-18.el7.x86_64

DEBUG util.py:266: ---&gt; Package zlib.x86_64 0:1.2.7-15.el7 will be installed

DEBUG util.py:266: --&gt; Running transaction check

DEBUG util.py:266: ---&gt; Package audit-libs.x86_64 0:2.4.1-5.el7 will be installed

DEBUG util.py:266: ---&gt; Package basesystem.noarch 0:10.0-7.el7.centos will be installed

DEBUG util.py:266: --&gt; Processing Dependency: filesystem for package: basesystem-10.0-7.el7.centos.noarch

DEBUG util.py:266: ---&gt; Package glibc-common.x86_64 0:2.17-106.el7_2.8 will be installed

DEBUG util.py:266: --&gt; Processing Dependency: tzdata &gt;= 2003a for package: glibc-common-2.17-106.el7_2.8.x86_64

DEBUG util.py:266: ---&gt; Package gmp.x86_64 1:6.0.0-12.el7_1 will be installed

DEBUG util.py:266: --&gt; Processing Dependency: libstdc++.so.6(GLIBCXX_3.4.11)(64bit) for package: 1:gmp-6.0.0-12.el7_1.x86_64

DEBUG util.py:266: --&gt; Processing Dependency: libstdc++.so.6(GLIBCXX_3.4)(64bit) for package: 1:gmp-6.0.0-12.el7_1.x86_64

DEBUG util.py:266: --&gt; Processing Dependency: libstdc++.so.6(CXXABI_1.3)(64bit) for package: 1:gmp-6.0.0-12.el7_1.x86_64

DEBUG util.py:266: --&gt; Processing Dependency: libstdc++.so.6()(64bit) for package: 1:gmp-6.0.0-12.el7_1.x86_64

DEBUG util.py:266: ---&gt; Package grep.x86_64 0:2.20-2.el7 will be installed

DEBUG util.py:266: --&gt; Processing Dependency: libpcre.so.1()(64bit) for package: grep-2.20-2.el7.x86_64

DEBUG util.py:266: ---&gt; Package info.x86_64 0:5.1-4.el7 will be installed

DEBUG util.py:266: ---&gt; Package libacl.x86_64 0:2.2.51-12.el7 will be installed

DEBUG util.py:266: ---&gt; Package libattr.x86_64 0:2.4.46-12.el7 will be installed

DEBUG util.py:266: ---&gt; Package libcap.x86_64 0:2.22-8.el7 will be installed

DEBUG util.py:266: ---&gt; Package libgcc.x86_64 0:4.8.5-4.el7 will be installed

DEBUG util.py:266: ---&gt; Package libselinux.x86_64 0:2.2.2-6.el7 will be installed

DEBUG util.py:266: --&gt; Processing Dependency: libsepol &gt;= 2.1.9-1 for package: libselinux-2.2.2-6.el7.x86_64

DEBUG util.py:266: --&gt; Processing Dependency: liblzma.so.5(XZ_5.0)(64bit) for package: libselinux-2.2.2-6.el7.x86_64

DEBUG util.py:266: --&gt; Processing Dependency: liblzma.so.5()(64bit) for package: libselinux-2.2.2-6.el7.x86_64

DEBUG util.py:266: ---&gt; Package libsemanage.x86_64 0:2.1.10-18.el7 will be installed

DEBUG util.py:266: --&gt; Processing Dependency: libustr-1.0.so.1(USTR_1.0.1)(64bit) for package: libsemanage-2.1.10-18.el7.x86_64

DEBUG util.py:266: --&gt; Processing Dependency: libustr-1.0.so.1(USTR_1.0)(64bit) for package: libsemanage-2.1.10-18.el7.x86_64

DEBUG util.py:266: --&gt; Processing Dependency: bzip2-libs for package: libsemanage-2.1.10-18.el7.x86_64

DEBUG util.py:266: --&gt; Processing Dependency: libustr-1.0.so.1()(64bit) for package: libsemanage-2.1.10-18.el7.x86_64

DEBUG util.py:266: --&gt; Processing Dependency: libbz2.so.1()(64bit) for package: libsemanage-2.1.10-18.el7.x86_64

DEBUG util.py:266: ---&gt; Package ncurses.x86_64 0:5.9-13.20130511.el7 will be installed

DEBUG util.py:266: ---&gt; Package ncurses-libs.x86_64 0:5.9-13.20130511.el7 will be installed

DEBUG util.py:266: --&gt; Processing Dependency: ncurses-base = 5.9-13.20130511.el7 for package: ncurses-libs-5.9-13.20130511.el7.x86_64

DEBUG util.py:266: ---&gt; Package nss-softokn-freebl.x86_64 0:3.16.2.3-14.2.el7_2 will be installed

DEBUG util.py:266: ---&gt; Package openssl-libs.x86_64 1:1.0.1e-51.el7_2.7 will be installed

DEBUG util.py:266: --&gt; Processing Dependency: ca-certificates &gt;= 2008-5 for package: 1:openssl-libs-1.0.1e-51.el7_2.7.x86_64

DEBUG util.py:266: --&gt; Processing Dependency: libkrb5.so.3(krb5_3_MIT)(64bit) for package: 1:openssl-libs-1.0.1e-51.el7_2.7.x86_64

DEBUG util.py:266: --&gt; Processing Dependency: libk5crypto.so.3(k5crypto_3_MIT)(64bit) for package: 1:openssl-libs-1.0.1e-51.el7_2.7.x86_64

DEBUG util.py:266: --&gt; Processing Dependency: libkrb5.so.3()(64bit) for package: 1:openssl-libs-1.0.1e-51.el7_2.7.x86_64

DEBUG util.py:266: --&gt; Processing Dependency: libk5crypto.so.3()(64bit) for package: 1:openssl-libs-1.0.1e-51.el7_2.7.x86_64

DEBUG util.py:266: --&gt; Processing Dependency: libgssapi_krb5.so.2()(64bit) for package: 1:openssl-libs-1.0.1e-51.el7_2.7.x86_64

DEBUG util.py:266: --&gt; Processing Dependency: libcom_err.so.2()(64bit) for package: 1:openssl-libs-1.0.1e-51.el7_2.7.x86_64

DEBUG util.py:266: ---&gt; Package setup.noarch 0:2.8.71-6.el7 will be installed

DEBUG util.py:266: --&gt; Processing Dependency: system-release for package: setup-2.8.71-6.el7.noarch

DEBUG util.py:266: --&gt; Running transaction check

DEBUG util.py:266: ---&gt; Package bzip2-libs.x86_64 0:1.0.6-13.el7 will be installed

DEBUG util.py:266: ---&gt; Package ca-certificates.noarch 0:2015.2.6-70.1.el7_2 will be installed

DEBUG util.py:266: --&gt; Processing Dependency: p11-kit-trust &gt;= 0.17.3 for package: ca-certificates-2015.2.6-70.1.el7_2.noarch

DEBUG util.py:266: --&gt; Processing Dependency: p11-kit &gt;= 0.17.3 for package: ca-certificates-2015.2.6-70.1.el7_2.noarch

DEBUG util.py:266: ---&gt; Package centos-release.x86_64 0:7-2.1511.el7.centos.2.10 will be installed

DEBUG util.py:266: ---&gt; Package filesystem.x86_64 0:3.2-20.el7 will be installed

DEBUG util.py:266: ---&gt; Package krb5-libs.x86_64 0:1.13.2-12.el7_2 will be installed

DEBUG util.py:266: --&gt; Processing Dependency: keyutils-libs &gt;= 1.5.8 for package: krb5-libs-1.13.2-12.el7_2.x86_64

DEBUG util.py:266: --&gt; Processing Dependency: sed for package: krb5-libs-1.13.2-12.el7_2.x86_64

DEBUG util.py:266: --&gt; Processing Dependency: libkeyutils.so.1(KEYUTILS_1.5)(64bit) for package: krb5-libs-1.13.2-12.el7_2.x86_64

DEBUG util.py:266: --&gt; Processing Dependency: libkeyutils.so.1(KEYUTILS_1.0)(64bit) for package: krb5-libs-1.13.2-12.el7_2.x86_64

DEBUG util.py:266: --&gt; Processing Dependency: libkeyutils.so.1(KEYUTILS_0.3)(64bit) for package: krb5-libs-1.13.2-12.el7_2.x86_64

DEBUG util.py:266: --&gt; Processing Dependency: gawk for package: krb5-libs-1.13.2-12.el7_2.x86_64

DEBUG util.py:266: --&gt; Processing Dependency: libverto.so.1()(64bit) for package: krb5-libs-1.13.2-12.el7_2.x86_64

DEBUG util.py:266: --&gt; Processing Dependency: libkeyutils.so.1()(64bit) for package: krb5-libs-1.13.2-12.el7_2.x86_64

DEBUG util.py:266: ---&gt; Package libcom_err.x86_64 0:1.42.9-7.el7 will be installed

DEBUG util.py:266: ---&gt; Package libsepol.x86_64 0:2.1.9-3.el7 will be installed

DEBUG util.py:266: ---&gt; Package libstdc++.x86_64 0:4.8.5-4.el7 will be installed

DEBUG util.py:266: ---&gt; Package ncurses-base.noarch 0:5.9-13.20130511.el7 will be installed

DEBUG util.py:266: ---&gt; Package pcre.x86_64 0:8.32-15.el7_2.1 will be installed

DEBUG util.py:266: ---&gt; Package tzdata.noarch 0:2016h-1.el7 will be installed

DEBUG util.py:266: ---&gt; Package ustr.x86_64 0:1.0.4-16.el7 will be installed

DEBUG util.py:266: ---&gt; Package xz-libs.x86_64 0:5.1.2-12alpha.el7 will be installed

DEBUG util.py:266: --&gt; Running transaction check

DEBUG util.py:266: ---&gt; Package gawk.x86_64 0:4.0.2-4.el7 will be installed

DEBUG util.py:266: ---&gt; Package keyutils-libs.x86_64 0:1.5.8-3.el7 will be installed

DEBUG util.py:266: ---&gt; Package libverto.x86_64 0:0.2.5-4.el7 will be installed

DEBUG util.py:266: ---&gt; Package p11-kit.x86_64 0:0.20.7-3.el7 will be installed

DEBUG util.py:266: --&gt; Processing Dependency: libffi.so.6()(64bit) for package: p11-kit-0.20.7-3.el7.x86_64

DEBUG util.py:266: ---&gt; Package p11-kit-trust.x86_64 0:0.20.7-3.el7 will be installed

DEBUG util.py:266: --&gt; Processing Dependency: libtasn1.so.6(LIBTASN1_0_3)(64bit) for package: p11-kit-trust-0.20.7-3.el7.x86_64

DEBUG util.py:266: --&gt; Processing Dependency: /usr/sbin/update-alternatives for package: p11-kit-trust-0.20.7-3.el7.x86_64

DEBUG util.py:266: --&gt; Processing Dependency: /usr/sbin/update-alternatives for package: p11-kit-trust-0.20.7-3.el7.x86_64

DEBUG util.py:266: --&gt; Processing Dependency: libtasn1.so.6()(64bit) for package: p11-kit-trust-0.20.7-3.el7.x86_64

DEBUG util.py:266: ---&gt; Package sed.x86_64 0:4.2.2-5.el7 will be installed

DEBUG util.py:266: --&gt; Running transaction check

DEBUG util.py:266: ---&gt; Package chkconfig.x86_64 0:1.3.61-5.el7_2.1 will be installed

DEBUG util.py:266: --&gt; Processing Dependency: libpopt.so.0(LIBPOPT_0)(64bit) for package: chkconfig-1.3.61-5.el7_2.1.x86_64

DEBUG util.py:266: --&gt; Processing Dependency: libpopt.so.0()(64bit) for package: chkconfig-1.3.61-5.el7_2.1.x86_64

DEBUG util.py:266: ---&gt; Package libffi.x86_64 0:3.0.13-16.el7 will be installed

DEBUG util.py:266: ---&gt; Package libtasn1.x86_64 0:3.8-2.el7 will be installed

DEBUG util.py:266: --&gt; Running transaction check

DEBUG util.py:266: ---&gt; Package popt.x86_64 0:1.13-16.el7 will be installed

DEBUG util.py:266: --&gt; Finished Dependency Resolution

DEBUG util.py:266: Dependencies Resolved

DEBUG util.py:266: ================================================================================

DEBUG util.py:266: Package Arch Version Repository Size

DEBUG util.py:266: ================================================================================

DEBUG util.py:266: Installing:

DEBUG util.py:266: ccache x86_64 3.2.7-3.el7 epel 202 k

DEBUG util.py:266: Installing for dependencies:

DEBUG util.py:266: audit-libs x86_64 2.4.1-5.el7 base 80 k

DEBUG util.py:266: basesystem noarch 10.0-7.el7.centos base 5.0 k

DEBUG util.py:266: bash x86_64 4.2.46-20.el7_2 updates 1.0 M

DEBUG util.py:266: bzip2-libs x86_64 1.0.6-13.el7 base 40 k

DEBUG util.py:266: ca-certificates noarch 2015.2.6-70.1.el7_2 updates 428 k

DEBUG util.py:266: centos-release x86_64 7-2.1511.el7.centos.2.10 base 23 k

DEBUG util.py:266: chkconfig x86_64 1.3.61-5.el7_2.1 updates 173 k

DEBUG util.py:266: coreutils x86_64 8.22-15.el7_2.1 updates 3.2 M

DEBUG util.py:266: filesystem x86_64 3.2-20.el7 base 1.0 M

DEBUG util.py:266: gawk x86_64 4.0.2-4.el7 base 873 k

DEBUG util.py:266: glibc x86_64 2.17-106.el7_2.8 updates 3.6 M

DEBUG util.py:266: glibc-common x86_64 2.17-106.el7_2.8 updates 11 M

DEBUG util.py:266: gmp x86_64 1:6.0.0-12.el7_1 updates 280 k

DEBUG util.py:266: grep x86_64 2.20-2.el7 base 344 k

DEBUG util.py:266: info x86_64 5.1-4.el7 base 233 k

DEBUG util.py:266: keyutils-libs x86_64 1.5.8-3.el7 base 25 k

DEBUG util.py:266: krb5-libs x86_64 1.13.2-12.el7_2 updates 843 k

DEBUG util.py:266: libacl x86_64 2.2.51-12.el7 base 27 k

DEBUG util.py:266: libattr x86_64 2.4.46-12.el7 base 18 k

DEBUG util.py:266: libcap x86_64 2.22-8.el7 base 47 k

DEBUG util.py:266: libcom_err x86_64 1.42.9-7.el7 base 40 k

DEBUG util.py:266: libffi x86_64 3.0.13-16.el7 base 30 k

DEBUG util.py:266: libgcc x86_64 4.8.5-4.el7 base 95 k

DEBUG util.py:266: libselinux x86_64 2.2.2-6.el7 base 145 k

DEBUG util.py:266: libsemanage x86_64 2.1.10-18.el7 base 123 k

DEBUG util.py:266: libsepol x86_64 2.1.9-3.el7 base 154 k

DEBUG util.py:266: libstdc++ x86_64 4.8.5-4.el7 base 298 k

DEBUG util.py:266: libtasn1 x86_64 3.8-2.el7 base 319 k

DEBUG util.py:266: libverto x86_64 0.2.5-4.el7 base 16 k

DEBUG util.py:266: ncurses x86_64 5.9-13.20130511.el7 base 303 k

DEBUG util.py:266: ncurses-base noarch 5.9-13.20130511.el7 base 68 k

DEBUG util.py:266: ncurses-libs x86_64 5.9-13.20130511.el7 base 316 k

DEBUG util.py:266: nss-softokn-freebl x86_64 3.16.2.3-14.2.el7_2 updates 204 k

DEBUG util.py:266: openssl-libs x86_64 1:1.0.1e-51.el7_2.7 updates 953 k

DEBUG util.py:266: p11-kit x86_64 0.20.7-3.el7 base 107 k

DEBUG util.py:266: p11-kit-trust x86_64 0.20.7-3.el7 base 126 k

DEBUG util.py:266: pcre x86_64 8.32-15.el7_2.1 updates 420 k

DEBUG util.py:266: popt x86_64 1.13-16.el7 base 42 k

DEBUG util.py:266: sed x86_64 4.2.2-5.el7 base 231 k

DEBUG util.py:266: setup noarch 2.8.71-6.el7 base 165 k

DEBUG util.py:266: shadow-utils x86_64 2:4.1.5.1-18.el7 base 1.1 M

DEBUG util.py:266: tzdata noarch 2016h-1.el7 updates 439 k

DEBUG util.py:266: ustr x86_64 1.0.4-16.el7 base 92 k

DEBUG util.py:266: xz-libs x86_64 5.1.2-12alpha.el7 base 102 k

DEBUG util.py:266: zlib x86_64 1.2.7-15.el7 base 89 k

DEBUG util.py:266: Transaction Summary

DEBUG util.py:266: ================================================================================

DEBUG util.py:266: Install 46 Packages

DEBUG util.py:266: Total size: 30 M

DEBUG util.py:266: Installed size: 171 M

DEBUG util.py:266: Downloading Packages:

DEBUG util.py:266: warning: /var/lib/mock/epel-7-x86_64-4888/root/var/cache/yum/base/packages/filesystem-3.2-20.el7.x86_64.rpm: Header V3 RSA/SHA256 Signature, key ID f4a80eb5: NOKEY

DEBUG util.py:266: Retrieving key from file:///etc/mock/pki/RPM-GPG-KEY-CentOS-7

DEBUG util.py:266: Importing GPG key 0xF4A80EB5:

DEBUG util.py:266: Userid: &quot;CentOS-7 Key (CentOS 7 Official Signing Key) &lt;security@centos.org&gt;&quot;

DEBUG util.py:266: From : /etc/mock/pki/RPM-GPG-KEY-CentOS-7

DEBUG util.py:266: warning: /var/lib/mock/epel-7-x86_64-4888/root/var/cache/yum/epel/packages/ccache-3.2.7-3.el7.x86_64.rpm: Header V3 RSA/SHA256 Signature, key ID 352c64e5: NOKEY

DEBUG util.py:266: Retrieving key from file:///etc/mock/pki/RPM-GPG-KEY-EPEL-7

DEBUG util.py:266: Importing GPG key 0x352C64E5:

DEBUG util.py:266: Userid: &quot;Fedora EPEL (7) &lt;epel@fedoraproject.org&gt;&quot;

DEBUG util.py:266: From : /etc/mock/pki/RPM-GPG-KEY-EPEL-7

DEBUG util.py:266: Running Transaction Check

DEBUG util.py:266: Running Transaction Test

DEBUG util.py:266: Transaction Test Succeeded

DEBUG util.py:266: Running Transaction

DEBUG util.py:266: Warning: RPMDB altered outside of yum.

DEBUG util.py:266:
Installing : libgcc-4.8.5-4.el7.x86_64 1/46

DEBUG util.py:266:
Installing : centos-release-7-2.1511.el7.centos.2.10.x86_64 2/46

DEBUG util.py:266:
Installing : setup-2.8.71-6.el7.noarch 3/46

DEBUG util.py:266: warning: /etc/group created as /etc/group.rpmnew

DEBUG util.py:266: warning: /etc/gshadow created as /etc/gshadow.rpmnew

DEBUG util.py:266: warning: /etc/hosts created as /etc/hosts.rpmnew

DEBUG util.py:266: warning: /etc/passwd created as /etc/passwd.rpmnew

DEBUG util.py:266: warning: /etc/shadow created as /etc/shadow.rpmnew

DEBUG util.py:266:
Installing : filesystem-3.2-20.el7.x86_64 4/46

DEBUG util.py:266:
Installing : basesystem-10.0-7.el7.centos.noarch 5/46

DEBUG util.py:266:
Installing : ncurses-base-5.9-13.20130511.el7.noarch 6/46

DEBUG util.py:266:
Installing : tzdata-2016h-1.el7.noarch 7/46

DEBUG util.py:266:
Installing : nss-softokn-freebl-3.16.2.3-14.2.el7_2.x86_64 8/46

DEBUG util.py:266:
Installing : glibc-common-2.17-106.el7_2.8.x86_64 9/46

DEBUG util.py:266:
Installing : glibc-2.17-106.el7_2.8.x86_64 10/46

DEBUG util.py:266:
Installing : libstdc++-4.8.5-4.el7.x86_64 11/46

DEBUG util.py:266:
Installing : ncurses-libs-5.9-13.20130511.el7.x86_64 12/46

DEBUG util.py:266:
Installing : bash-4.2.46-20.el7_2.x86_64 13/46

DEBUG util.py:266:
Installing : libsepol-2.1.9-3.el7.x86_64 14/46

DEBUG util.py:266:
Installing : pcre-8.32-15.el7_2.1.x86_64 15/46

DEBUG util.py:266:
Installing : xz-libs-5.1.2-12alpha.el7.x86_64 16/46

DEBUG util.py:266:
Installing : libselinux-2.2.2-6.el7.x86_64 17/46

DEBUG util.py:266:
Installing : libattr-2.4.46-12.el7.x86_64 18/46

DEBUG util.py:266:
Installing : zlib-1.2.7-15.el7.x86_64 19/46

DEBUG util.py:266:
Installing : info-5.1-4.el7.x86_64 20/46

DEBUG util.py:266: warning: /usr/share/info/dir created as /usr/share/info/dir.rpmnew

DEBUG util.py:266:
Installing : grep-2.20-2.el7.x86_64 21/46

DEBUG util.py:266:
Installing : libacl-2.2.51-12.el7.x86_64 22/46

DEBUG util.py:266:
Installing : libffi-3.0.13-16.el7.x86_64 23/46

DEBUG util.py:266:
Installing : p11-kit-0.20.7-3.el7.x86_64 24/46

DEBUG util.py:266:
Installing : libcom_err-1.42.9-7.el7.x86_64 25/46

DEBUG util.py:266:
Installing : audit-libs-2.4.1-5.el7.x86_64 26/46

DEBUG util.py:266:
Installing : gawk-4.0.2-4.el7.x86_64 27/46

DEBUG util.py:266:
Installing : sed-4.2.2-5.el7.x86_64 28/46

DEBUG util.py:266:
Installing : libcap-2.22-8.el7.x86_64 29/46

DEBUG util.py:266:
Installing : ncurses-5.9-13.20130511.el7.x86_64 30/46

DEBUG util.py:266:
Installing : 1:gmp-6.0.0-12.el7_1.x86_64 31/46

DEBUG util.py:266:
Installing : keyutils-libs-1.5.8-3.el7.x86_64 32/46

DEBUG util.py:266:
Installing : popt-1.13-16.el7.x86_64 33/46

DEBUG util.py:266:
Installing : chkconfig-1.3.61-5.el7_2.1.x86_64 34/46

DEBUG util.py:266:
Installing : libverto-0.2.5-4.el7.x86_64 35/46

DEBUG util.py:266:
Installing : bzip2-libs-1.0.6-13.el7.x86_64 36/46

DEBUG util.py:266:
Installing : ustr-1.0.4-16.el7.x86_64 37/46

DEBUG util.py:266:
Installing : libsemanage-2.1.10-18.el7.x86_64 38/46

DEBUG util.py:266:
Installing : libtasn1-3.8-2.el7.x86_64 39/46

DEBUG util.py:266:
Installing : p11-kit-trust-0.20.7-3.el7.x86_64 40/46

DEBUG util.py:266:
Installing : krb5-libs-1.13.2-12.el7_2.x86_64 41/46

DEBUG util.py:266:
Installing : 1:openssl-libs-1.0.1e-51.el7_2.7.x86_64 42/46

DEBUG util.py:266:
Installing : coreutils-8.22-15.el7_2.1.x86_64 43/46

DEBUG util.py:266:
Installing : ca-certificates-2015.2.6-70.1.el7_2.noarch 44/46

DEBUG util.py:266:
Installing : 2:shadow-utils-4.1.5.1-18.el7.x86_64 45/46

DEBUG util.py:266:
Installing : ccache-3.2.7-3.el7.x86_64 46/46

DEBUG util.py:266: Installed:

DEBUG util.py:266: ccache.x86_64 0:3.2.7-3.el7

DEBUG util.py:266: Dependency Installed:

DEBUG util.py:266: audit-libs.x86_64 0:2.4.1-5.el7

DEBUG util.py:266: basesystem.noarch 0:10.0-7.el7.centos

DEBUG util.py:266: bash.x86_64 0:4.2.46-20.el7_2

DEBUG util.py:266: bzip2-libs.x86_64 0:1.0.6-13.el7

DEBUG util.py:266: ca-certificates.noarch 0:2015.2.6-70.1.el7_2

DEBUG util.py:266: centos-release.x86_64 0:7-2.1511.el7.centos.2.10

DEBUG util.py:266: chkconfig.x86_64 0:1.3.61-5.el7_2.1

DEBUG util.py:266: coreutils.x86_64 0:8.22-15.el7_2.1

DEBUG util.py:266: filesystem.x86_64 0:3.2-20.el7

DEBUG util.py:266: gawk.x86_64 0:4.0.2-4.el7

DEBUG util.py:266: glibc.x86_64 0:2.17-106.el7_2.8

DEBUG util.py:266: glibc-common.x86_64 0:2.17-106.el7_2.8

DEBUG util.py:266: gmp.x86_64 1:6.0.0-12.el7_1

DEBUG util.py:266: grep.x86_64 0:2.20-2.el7

DEBUG util.py:266: info.x86_64 0:5.1-4.el7

DEBUG util.py:266: keyutils-libs.x86_64 0:1.5.8-3.el7

DEBUG util.py:266: krb5-libs.x86_64 0:1.13.2-12.el7_2

DEBUG util.py:266: libacl.x86_64 0:2.2.51-12.el7

DEBUG util.py:266: libattr.x86_64 0:2.4.46-12.el7

DEBUG util.py:266: libcap.x86_64 0:2.22-8.el7

DEBUG util.py:266: libcom_err.x86_64 0:1.42.9-7.el7

DEBUG util.py:266: libffi.x86_64 0:3.0.13-16.el7

DEBUG util.py:266: libgcc.x86_64 0:4.8.5-4.el7

DEBUG util.py:266: libselinux.x86_64 0:2.2.2-6.el7

DEBUG util.py:266: libsemanage.x86_64 0:2.1.10-18.el7

DEBUG util.py:266: libsepol.x86_64 0:2.1.9-3.el7

DEBUG util.py:266: libstdc++.x86_64 0:4.8.5-4.el7

DEBUG util.py:266: libtasn1.x86_64 0:3.8-2.el7

DEBUG util.py:266: libverto.x86_64 0:0.2.5-4.el7

DEBUG util.py:266: ncurses.x86_64 0:5.9-13.20130511.el7

DEBUG util.py:266: ncurses-base.noarch 0:5.9-13.20130511.el7

DEBUG util.py:266: ncurses-libs.x86_64 0:5.9-13.20130511.el7

DEBUG util.py:266: nss-softokn-freebl.x86_64 0:3.16.2.3-14.2.el7_2

DEBUG util.py:266: openssl-libs.x86_64 1:1.0.1e-51.el7_2.7

DEBUG util.py:266: p11-kit.x86_64 0:0.20.7-3.el7

DEBUG util.py:266: p11-kit-trust.x86_64 0:0.20.7-3.el7

DEBUG util.py:266: pcre.x86_64 0:8.32-15.el7_2.1

DEBUG util.py:266: popt.x86_64 0:1.13-16.el7

DEBUG util.py:266: sed.x86_64 0:4.2.2-5.el7

DEBUG util.py:266: setup.noarch 0:2.8.71-6.el7

DEBUG util.py:266: shadow-utils.x86_64 2:4.1.5.1-18.el7

DEBUG util.py:266: tzdata.noarch 0:2016h-1.el7

DEBUG util.py:266: ustr.x86_64 0:1.0.4-16.el7

DEBUG util.py:266: xz-libs.x86_64 0:5.1.2-12alpha.el7

DEBUG util.py:266: zlib.x86_64 0:1.2.7-15.el7

DEBUG util.py:266: Complete!

DEBUG util.py:356: Child return code was: 0

DEBUG backend.py:947: [&#39;/usr/bin/yum-builddep&#39;, &#39;--installroot&#39;, &#39;/var/lib/mock/epel-7-x86_64-4888/root/&#39;, &#39;/var/lib/mock/epel-7-x86_64-4888/root///builddir/build/SRPMS/python-logilab-common-1.3.0-logilab.1.el7.centos~revf3ab15166db9.src.rpm&#39;]

DEBUG util.py:316: Executing command: [&#39;/usr/bin/yum-builddep&#39;, &#39;--installroot&#39;, &#39;/var/lib/mock/epel-7-x86_64-4888/root/&#39;, &#39;/var/lib/mock/epel-7-x86_64-4888/root///builddir/build/SRPMS/python-logilab-common-1.3.0-logilab.1.el7.centos~revf3ab15166db9.src.rpm&#39;] with env {&#39;LANG&#39;: &#39;en_US.UTF-8&#39;, &#39;TERM&#39;: &#39;vt100&#39;, &#39;SHELL&#39;: &#39;/bin/bash&#39;, &#39;CCACHE_DIR&#39;: &#39;/tmp/ccache&#39;, &#39;HOSTNAME&#39;: &#39;mock&#39;, &#39;PROMPT_COMMAND&#39;: &#39;echo -n &quot;&lt;mock-chroot&gt;&quot;&#39;, &#39;HOME&#39;: &#39;/builddir&#39;, &#39;PATH&#39;: &#39;/usr/bin:/bin:/usr/sbin:/sbin&#39;, &#39;CCACHE_UMASK&#39;: &#39;002&#39;}

DEBUG util.py:266: Getting requirements for python-logilab-common-1.3.0-logilab.1.el7.centos~revf3ab15166db9.src

DEBUG util.py:266: --&gt; python-devel-2.7.5-39.el7_2.x86_64

DEBUG util.py:266: --&gt; python-setuptools-0.9.8-4.el7.noarch

DEBUG util.py:266: --&gt; python-unittest2-1.1.0-4.el7.noarch

DEBUG util.py:266: --&gt; pytz-2012d-5.el7.noarch

DEBUG util.py:266: --&gt; Running transaction check

DEBUG util.py:266: ---&gt; Package python-devel.x86_64 0:2.7.5-39.el7_2 will be installed

DEBUG util.py:266: --&gt; Processing Dependency: python(x86-64) = 2.7.5-39.el7_2 for package: python-devel-2.7.5-39.el7_2.x86_64

DEBUG util.py:266: --&gt; Processing Dependency: pkgconfig for package: python-devel-2.7.5-39.el7_2.x86_64

DEBUG util.py:266: --&gt; Processing Dependency: /usr/bin/python2.7 for package: python-devel-2.7.5-39.el7_2.x86_64

DEBUG util.py:266: --&gt; Processing Dependency: /usr/bin/pkg-config for package: python-devel-2.7.5-39.el7_2.x86_64

DEBUG util.py:266: --&gt; Processing Dependency: libpython2.7.so.1.0()(64bit) for package: python-devel-2.7.5-39.el7_2.x86_64

DEBUG util.py:266: ---&gt; Package python-setuptools.noarch 0:0.9.8-4.el7 will be installed

DEBUG util.py:266: --&gt; Processing Dependency: python-backports-ssl_match_hostname for package: python-setuptools-0.9.8-4.el7.noarch

DEBUG util.py:266: ---&gt; Package python-unittest2.noarch 0:1.1.0-4.el7 will be installed

DEBUG util.py:266: --&gt; Processing Dependency: python-traceback2 for package: python-unittest2-1.1.0-4.el7.noarch

DEBUG util.py:266: --&gt; Processing Dependency: python-six for package: python-unittest2-1.1.0-4.el7.noarch

DEBUG util.py:266: ---&gt; Package pytz.noarch 0:2012d-5.el7 will be installed

DEBUG util.py:266: --&gt; Running transaction check

DEBUG util.py:266: ---&gt; Package pkgconfig.x86_64 1:0.27.1-4.el7 will be installed

DEBUG util.py:266: --&gt; Processing Dependency: libglib-2.0.so.0()(64bit) for package: 1:pkgconfig-0.27.1-4.el7.x86_64

DEBUG util.py:266: ---&gt; Package python.x86_64 0:2.7.5-39.el7_2 will be installed

DEBUG util.py:266: ---&gt; Package python-backports-ssl_match_hostname.noarch 0:3.4.0.2-4.el7 will be installed

DEBUG util.py:266: --&gt; Processing Dependency: python-backports for package: python-backports-ssl_match_hostname-3.4.0.2-4.el7.noarch

DEBUG util.py:266: ---&gt; Package python-libs.x86_64 0:2.7.5-39.el7_2 will be installed

DEBUG util.py:266: --&gt; Processing Dependency: expat &gt;= 2.1.0 for package: python-libs-2.7.5-39.el7_2.x86_64

DEBUG util.py:266: --&gt; Processing Dependency: libsqlite3.so.0()(64bit) for package: python-libs-2.7.5-39.el7_2.x86_64

DEBUG util.py:266: --&gt; Processing Dependency: libreadline.so.6()(64bit) for package: python-libs-2.7.5-39.el7_2.x86_64

DEBUG util.py:266: --&gt; Processing Dependency: libgdbm_compat.so.4()(64bit) for package: python-libs-2.7.5-39.el7_2.x86_64

DEBUG util.py:266: --&gt; Processing Dependency: libgdbm.so.4()(64bit) for package: python-libs-2.7.5-39.el7_2.x86_64

DEBUG util.py:266: --&gt; Processing Dependency: libexpat.so.1()(64bit) for package: python-libs-2.7.5-39.el7_2.x86_64

DEBUG util.py:266: --&gt; Processing Dependency: libdb-5.3.so()(64bit) for package: python-libs-2.7.5-39.el7_2.x86_64

DEBUG util.py:266: ---&gt; Package python-six.noarch 0:1.9.0-2.el7 will be installed

DEBUG util.py:266: ---&gt; Package python2-traceback2.noarch 0:1.4.0-7.el7 will be installed

DEBUG util.py:266: --&gt; Processing Dependency: python-linecache2 for package: python2-traceback2-1.4.0-7.el7.noarch

DEBUG util.py:266: --&gt; Running transaction check

DEBUG util.py:266: ---&gt; Package expat.x86_64 0:2.1.0-8.el7 will be installed

DEBUG util.py:266: ---&gt; Package gdbm.x86_64 0:1.10-8.el7 will be installed

DEBUG util.py:266: ---&gt; Package glib2.x86_64 0:2.42.2-5.el7 will be installed

DEBUG util.py:266: --&gt; Processing Dependency: shared-mime-info for package: glib2-2.42.2-5.el7.x86_64

DEBUG util.py:266: ---&gt; Package libdb.x86_64 0:5.3.21-19.el7 will be installed

DEBUG util.py:266: ---&gt; Package python-backports.x86_64 0:1.0-8.el7 will be installed

DEBUG util.py:266: ---&gt; Package python-linecache2.noarch 0:1.0.0-1.el7 will be installed

DEBUG util.py:266: ---&gt; Package readline.x86_64 0:6.2-9.el7 will be installed

DEBUG util.py:266: ---&gt; Package sqlite.x86_64 0:3.7.17-8.el7 will be installed

DEBUG util.py:266: --&gt; Running transaction check

DEBUG util.py:266: ---&gt; Package shared-mime-info.x86_64 0:1.1-9.el7 will be installed

DEBUG util.py:266: --&gt; Processing Dependency: libxml2.so.2(LIBXML2_2.4.30)(64bit) for package: shared-mime-info-1.1-9.el7.x86_64

DEBUG util.py:266: --&gt; Processing Dependency: libxml2.so.2()(64bit) for package: shared-mime-info-1.1-9.el7.x86_64

DEBUG util.py:266: --&gt; Running transaction check

DEBUG util.py:266: ---&gt; Package libxml2.x86_64 0:2.9.1-6.el7_2.3 will be installed

DEBUG util.py:266: --&gt; Finished Dependency Resolution

DEBUG util.py:266: Dependencies Resolved

DEBUG util.py:266: ================================================================================

DEBUG util.py:266: Package Arch Version Repository

DEBUG util.py:266: Size

DEBUG util.py:266: ================================================================================

DEBUG util.py:266: Installing:

DEBUG util.py:266: python-devel x86_64 2.7.5-39.el7_2 updates 392 k

DEBUG util.py:266: python-setuptools noarch 0.9.8-4.el7 base 396 k

DEBUG util.py:266: python-unittest2 noarch 1.1.0-4.el7 epel 174 k

DEBUG util.py:266: pytz noarch 2012d-5.el7 base 38 k

DEBUG util.py:266: Installing for dependencies:

DEBUG util.py:266: expat x86_64 2.1.0-8.el7 base 80 k

DEBUG util.py:266: gdbm x86_64 1.10-8.el7 base 70 k

DEBUG util.py:266: glib2 x86_64 2.42.2-5.el7 base 2.2 M

DEBUG util.py:266: libdb x86_64 5.3.21-19.el7 base 718 k

DEBUG util.py:266: libxml2 x86_64 2.9.1-6.el7_2.3 updates 668 k

DEBUG util.py:266: pkgconfig x86_64 1:0.27.1-4.el7 base 54 k

DEBUG util.py:266: python x86_64 2.7.5-39.el7_2 updates 89 k

DEBUG util.py:266: python-backports x86_64 1.0-8.el7 base 5.8 k

DEBUG util.py:266: python-backports-ssl_match_hostname noarch 3.4.0.2-4.el7 base 12 k

DEBUG util.py:266: python-libs x86_64 2.7.5-39.el7_2 updates 5.6 M

DEBUG util.py:266: python-linecache2 noarch 1.0.0-1.el7 epel 12 k

DEBUG util.py:266: python-six noarch 1.9.0-2.el7 base 29 k

DEBUG util.py:266: python2-traceback2 noarch 1.4.0-7.el7 epel 19 k

DEBUG util.py:266: readline x86_64 6.2-9.el7 base 192 k

DEBUG util.py:266: shared-mime-info x86_64 1.1-9.el7 base 371 k

DEBUG util.py:266: sqlite x86_64 3.7.17-8.el7 base 393 k

DEBUG util.py:266: Transaction Summary

DEBUG util.py:266: ================================================================================

DEBUG util.py:266: Install 20 Packages

DEBUG util.py:266: Total size: 11 M

DEBUG util.py:266: Installed size: 47 M

DEBUG util.py:266: Downloading Packages:

DEBUG util.py:266: Running Transaction Check

DEBUG util.py:266: Running Transaction Test

DEBUG util.py:266: Transaction Test Succeeded

DEBUG util.py:266: Running Transaction

DEBUG util.py:266:
Installing : readline-6.2-9.el7.x86_64 1/20

DEBUG util.py:266:
Installing : sqlite-3.7.17-8.el7.x86_64 2/20

DEBUG util.py:266:
Installing : libxml2-2.9.1-6.el7_2.3.x86_64 3/20

DEBUG util.py:266:
Installing : glib2-2.42.2-5.el7.x86_64 4/20

DEBUG util.py:266:
Installing : 1:pkgconfig-0.27.1-4.el7.x86_64 5/20

DEBUG util.py:266:
Installing : shared-mime-info-1.1-9.el7.x86_64 6/20

DEBUG util.py:266:
Installing : libdb-5.3.21-19.el7.x86_64 7/20

DEBUG util.py:266:
Installing : gdbm-1.10-8.el7.x86_64 8/20

DEBUG util.py:266:
Installing : expat-2.1.0-8.el7.x86_64 9/20

DEBUG util.py:266:
Installing : python-libs-2.7.5-39.el7_2.x86_64 10/20

DEBUG util.py:266:
Installing : python-2.7.5-39.el7_2.x86_64 11/20

DEBUG util.py:266:
Installing : python-linecache2-1.0.0-1.el7.noarch 12/20

DEBUG util.py:266:
Installing : python2-traceback2-1.4.0-7.el7.noarch 13/20

DEBUG util.py:266:
Installing : python-backports-1.0-8.el7.x86_64 14/20

DEBUG util.py:266:
Installing : python-backports-ssl_match_hostname-3.4.0.2-4.el7.noarch 15/20

DEBUG util.py:266:
Installing : python-setuptools-0.9.8-4.el7.noarch 16/20

DEBUG util.py:266:
Installing : python-six-1.9.0-2.el7.noarch 17/20

DEBUG util.py:266:
Installing : python-unittest2-1.1.0-4.el7.noarch 18/20

DEBUG util.py:266:
Installing : python-devel-2.7.5-39.el7_2.x86_64 19/20

DEBUG util.py:266:
Installing : pytz-2012d-5.el7.noarch 20/20

DEBUG util.py:266: Installed:

DEBUG util.py:266: python-devel.x86_64 0:2.7.5-39.el7_2 python-setuptools.noarch 0:0.9.8-4.el7

DEBUG util.py:266: python-unittest2.noarch 0:1.1.0-4.el7 pytz.noarch 0:2012d-5.el7

DEBUG util.py:266: Dependency Installed:

DEBUG util.py:266: expat.x86_64 0:2.1.0-8.el7

DEBUG util.py:266: gdbm.x86_64 0:1.10-8.el7

DEBUG util.py:266: glib2.x86_64 0:2.42.2-5.el7

DEBUG util.py:266: libdb.x86_64 0:5.3.21-19.el7

DEBUG util.py:266: libxml2.x86_64 0:2.9.1-6.el7_2.3

DEBUG util.py:266: pkgconfig.x86_64 1:0.27.1-4.el7

DEBUG util.py:266: python.x86_64 0:2.7.5-39.el7_2

DEBUG util.py:266: python-backports.x86_64 0:1.0-8.el7

DEBUG util.py:266: python-backports-ssl_match_hostname.noarch 0:3.4.0.2-4.el7

DEBUG util.py:266: python-libs.x86_64 0:2.7.5-39.el7_2

DEBUG util.py:266: python-linecache2.noarch 0:1.0.0-1.el7

DEBUG util.py:266: python-six.noarch 0:1.9.0-2.el7

DEBUG util.py:266: python2-traceback2.noarch 0:1.4.0-7.el7

DEBUG util.py:266: readline.x86_64 0:6.2-9.el7

DEBUG util.py:266: shared-mime-info.x86_64 0:1.1-9.el7

DEBUG util.py:266: sqlite.x86_64 0:3.7.17-8.el7

DEBUG util.py:266: Complete!

DEBUG util.py:356: Child return code was: 0

DEBUG util.py:316: Executing command: [&#39;ccache&#39;, &#39;-M&#39;, &#39;4G&#39;] with env {&#39;LANG&#39;: &#39;en_US.UTF-8&#39;, &#39;TERM&#39;: &#39;vt100&#39;, &#39;SHELL&#39;: &#39;/bin/bash&#39;, &#39;CCACHE_DIR&#39;: &#39;/tmp/ccache&#39;, &#39;HOSTNAME&#39;: &#39;mock&#39;, &#39;PROMPT_COMMAND&#39;: &#39;echo -n &quot;&lt;mock-chroot&gt;&quot;&#39;, &#39;HOME&#39;: &#39;/builddir&#39;, &#39;PATH&#39;: &#39;/usr/bin:/bin:/usr/sbin:/sbin&#39;, &#39;CCACHE_UMASK&#39;: &#39;002&#39;}

DEBUG util.py:266: Set cache size limit to 4.0 GB

DEBUG util.py:356: Child return code was: 0

DEBUG util.py:316: Executing command: /usr/bin/repoquery -c /tmp/tmpyreOf7 --installed -a --qf &#39;%{nevra} %{buildtime} %{size} %{pkgid} %{yumdb_info.from_repo}&#39; &gt; /tmp/tmpE_0cl1/installed_pkgs with env {&#39;LANG&#39;: &#39;en_US.UTF-8&#39;, &#39;TERM&#39;: &#39;vt100&#39;, &#39;SHELL&#39;: &#39;/bin/bash&#39;, &#39;HOSTNAME&#39;: &#39;mock&#39;, &#39;HOME&#39;: &#39;/builddir&#39;, &#39;PATH&#39;: &#39;/usr/bin:/bin:/usr/sbin:/sbin&#39;}

DEBUG util.py:356: Child return code was: 0

DEBUG backend.py:721: Copying packages to result dir

DEBUG util.py:316: Executing command: [&#39;/bin/umount&#39;, &#39;-n&#39;, &#39;/var/lib/mock/epel-7-x86_64-4888/root/tmp/ccache&#39;] with env {&#39;LANG&#39;: &#39;en_US.UTF-8&#39;, &#39;TERM&#39;: &#39;vt100&#39;, &#39;SHELL&#39;: &#39;/bin/bash&#39;, &#39;HOSTNAME&#39;: &#39;mock&#39;, &#39;HOME&#39;: &#39;/builddir&#39;, &#39;PATH&#39;: &#39;/usr/bin:/bin:/usr/sbin:/sbin&#39;}

DEBUG util.py:356: Child return code was: 0

DEBUG util.py:316: Executing command: [&#39;/bin/umount&#39;, &#39;-n&#39;, &#39;/var/lib/mock/epel-7-x86_64-4888/root/var/cache/yum&#39;] with env {&#39;LANG&#39;: &#39;en_US.UTF-8&#39;, &#39;TERM&#39;: &#39;vt100&#39;, &#39;SHELL&#39;: &#39;/bin/bash&#39;, &#39;HOSTNAME&#39;: &#39;mock&#39;, &#39;HOME&#39;: &#39;/builddir&#39;, &#39;PATH&#39;: &#39;/usr/bin:/bin:/usr/sbin:/sbin&#39;}

DEBUG util.py:356: Child return code was: 0

DEBUG util.py:316: Executing command: [&#39;/bin/umount&#39;, &#39;-n&#39;, &#39;-l&#39;, &#39;/var/lib/mock/epel-7-x86_64-4888/root/dev/pts&#39;] with env {&#39;LANG&#39;: &#39;en_US.UTF-8&#39;, &#39;TERM&#39;: &#39;vt100&#39;, &#39;SHELL&#39;: &#39;/bin/bash&#39;, &#39;HOSTNAME&#39;: &#39;mock&#39;, &#39;HOME&#39;: &#39;/builddir&#39;, &#39;PATH&#39;: &#39;/usr/bin:/bin:/usr/sbin:/sbin&#39;}

DEBUG util.py:356: Child return code was: 0

DEBUG util.py:316: Executing command: [&#39;/bin/umount&#39;, &#39;-n&#39;, &#39;-l&#39;, &#39;/var/lib/mock/epel-7-x86_64-4888/root/dev/shm&#39;] with env {&#39;LANG&#39;: &#39;en_US.UTF-8&#39;, &#39;TERM&#39;: &#39;vt100&#39;, &#39;SHELL&#39;: &#39;/bin/bash&#39;, &#39;HOSTNAME&#39;: &#39;mock&#39;, &#39;HOME&#39;: &#39;/builddir&#39;, &#39;PATH&#39;: &#39;/usr/bin:/bin:/usr/sbin:/sbin&#39;}

DEBUG util.py:356: Child return code was: 0

DEBUG util.py:316: Executing command: [&#39;/bin/umount&#39;, &#39;-n&#39;, &#39;-l&#39;, &#39;/var/lib/mock/epel-7-x86_64-4888/root/sys&#39;] with env {&#39;LANG&#39;: &#39;en_US.UTF-8&#39;, &#39;TERM&#39;: &#39;vt100&#39;, &#39;SHELL&#39;: &#39;/bin/bash&#39;, &#39;HOSTNAME&#39;: &#39;mock&#39;, &#39;HOME&#39;: &#39;/builddir&#39;, &#39;PATH&#39;: &#39;/usr/bin:/bin:/usr/sbin:/sbin&#39;}

DEBUG util.py:356: Child return code was: 0

DEBUG util.py:316: Executing command: [&#39;/bin/umount&#39;, &#39;-n&#39;, &#39;-l&#39;, &#39;/var/lib/mock/epel-7-x86_64-4888/root/proc&#39;] with env {&#39;LANG&#39;: &#39;en_US.UTF-8&#39;, &#39;TERM&#39;: &#39;vt100&#39;, &#39;SHELL&#39;: &#39;/bin/bash&#39;, &#39;HOSTNAME&#39;: &#39;mock&#39;, &#39;HOME&#39;: &#39;/builddir&#39;, &#39;PATH&#39;: &#39;/usr/bin:/bin:/usr/sbin:/sbin&#39;}

DEBUG util.py:356: Child return code was: 0

DEBUG util.py:118: kill orphans

DEBUG util.py:90: remove tree: /var/lib/mock/epel-7-x86_64-4888.tmp

INFO backend.py:220: chroot (/var/lib/mock/epel-7-x86_64-4888) unlocked and deleted

DEBUG util.py:118: kill orphans
<br/>20 printing /tmp/tmp3xvLni/common/../epel-7-x86_64/state.log: 2016-11-18 13:10:09,767 - Mock Version: 1.1.33

2016-11-18 13:10:09,768 - Start: unpacking root cache

2016-11-18 13:10:13,965 - Finish: unpacking root cache

2016-11-18 13:10:13,965 - Start: cleaning yum metadata

2016-11-18 13:10:13,967 - Finish: cleaning yum metadata

2016-11-18 13:10:13,971 - Start: device setup

2016-11-18 13:10:13,973 - Finish: device setup

2016-11-18 13:10:13,973 - Start: yum update

2016-11-18 13:10:21,525 - Start: Outputting list of available packages

2016-11-18 13:10:32,356 - Finish: Outputting list of available packages

2016-11-18 13:10:32,356 - Finish: yum update

2016-11-18 13:10:32,617 - Finish: lock buildroot

2016-11-18 13:10:32,617 - Finish: chroot init

2016-11-18 13:10:32,665 - Start: buildsrpm

2016-11-18 13:10:32,667 - Start: rpmbuild -bs

2016-11-18 13:10:32,781 - Finish: rpmbuild -bs

2016-11-18 13:10:32,938 - Finish: buildsrpm

2016-11-18 13:10:32,938 - Start: lock buildroot

2016-11-18 13:10:32,939 - Start: clean chroot

2016-11-18 13:10:33,405 - Finish: clean chroot

2016-11-18 13:10:33,405 - Finish: lock buildroot

2016-11-18 13:10:33,406 - Finish: run

2016-11-18 13:10:33,778 - Mock Version: 1.1.33

2016-11-18 13:10:33,779 - Start: unpacking root cache

2016-11-18 13:10:37,817 - Finish: unpacking root cache

2016-11-18 13:10:37,817 - Start: cleaning yum metadata

2016-11-18 13:10:37,818 - Finish: cleaning yum metadata

2016-11-18 13:10:37,823 - Start: device setup

2016-11-18 13:10:37,824 - Finish: device setup

2016-11-18 13:10:37,825 - Start: yum update

2016-11-18 13:10:40,996 - Start: Outputting list of available packages

2016-11-18 13:10:45,220 - Finish: Outputting list of available packages

2016-11-18 13:10:45,220 - Finish: yum update

2016-11-18 13:10:45,401 - Finish: lock buildroot

2016-11-18 13:10:45,401 - Finish: chroot init

2016-11-18 13:10:45,421 - Start: build phase for python-logilab-common-1.3.0-logilab.1.el7.centos~revf3ab15166db9.src.rpm

2016-11-18 13:10:45,421 - Start: device setup

2016-11-18 13:10:45,424 - Finish: device setup

2016-11-18 13:10:45,445 - Start: build setup for python-logilab-common-1.3.0-logilab.1.el7.centos~revf3ab15166db9.src.rpm

2016-11-18 13:11:00,045 - Finish: build setup for python-logilab-common-1.3.0-logilab.1.el7.centos~revf3ab15166db9.src.rpm

2016-11-18 13:11:00,045 - Start: rpmbuild -bb python-logilab-common-1.3.0-logilab.1.el7.centos~revf3ab15166db9.src.rpm

2016-11-18 13:11:00,051 - Start: Outputting list of installed packages

2016-11-18 13:11:00,246 - Finish: Outputting list of installed packages

2016-11-18 13:11:04,920 - Finish: rpmbuild -bb python-logilab-common-1.3.0-logilab.1.el7.centos~revf3ab15166db9.src.rpm

2016-11-18 13:11:05,072 - Finish: build phase for python-logilab-common-1.3.0-logilab.1.el7.centos~revf3ab15166db9.src.rpm

2016-11-18 13:11:05,072 - Start: lock buildroot

2016-11-18 13:11:05,073 - Start: clean chroot

2016-11-18 13:11:05,532 - Finish: clean chroot

2016-11-18 13:11:05,532 - Finish: lock buildroot

2016-11-18 13:11:05,532 - Finish: run
<br/>

log from execution