log_file.txt

download

40 python2 -m tox --result-json=tox-results.json `python2 -m tox --result-json=tox-results.json` returned with status : 1
output:
GLOB sdist-make: /tmp/tmpVZd_WE/src/271177/setup.py
py27 create: /tmp/tmpVZd_WE/src/271177/.tox/py27
py27 installdeps: logilab-common, python-debian, chardet, setuptools
py27 inst: /tmp/tmpVZd_WE/src/271177/.tox/dist/logilab-packaging-1.3.1.zip
py27 runtests: PYTHONHASHSEED='2821100692'
py27 runtests: commands[0] | /tmp/tmpVZd_WE/src/271177/.tox/py27/bin/python -c from logilab.common import pytest; pytest.run() -t test
======================= unittest_lgputils.py =======================
WARNING:root:build directory not deleted: /tmp/tmpXLoIIa
.
======================= unittest_manifest.py =======================
...
====================== unittest_changelog.py =======================
.E....
======================================================================
ERROR: test_round_trip (unittest_changelog.DebianChangeLogTC)
----------------------------------------------------------------------
Traceback (most recent call last)
File "/tmp/tmpVZd_WE/src/271177/.tox/py27/local/lib/python2.7/site-packages/logilab/common/testlib.py", line 497, in _proceed
testfunc(*args, **kwargs)
File "/tmp/tmpVZd_WE/src/271177/test/unittest_changelog.py", line 17, in test_round_trip
cl.write(out)
File "/tmp/tmpVZd_WE/src/271177/.tox/py27/local/lib/python2.7/site-packages/logilab/common/changelog.py", line 247, in write
stream.write(self.format_title())
TypeError: unicode argument expected, got 'str'

no stdout
no stderr
==================== unittest_distributions.py =====================
....
===================== unittest_architecture.py =====================
.....
======================= unittest_pkginfo.py ========================
.
======================== unittest_build.py =========================
warning: check: missing required meta-data: url

warning: check: missing meta-data: either (author and author_email) or (maintainer and maintainer_email) must be supplied

warning: sdist: manifest template 'MANIFEST.in' does not exist (using default file list)

warning: sdist: standard file not found: should have one of README, README.txt

dpkg-source: warning: no source format specified in debian/source/format, see dpkg-source(1)
dpkg-source: info: using source format `1.0'
dpkg-source: info: building test using existing test_1.orig.tar.gz
dpkg-source: info: building test in test_1-1.diff.gz
dpkg-source: warning: the diff modifies the following upstream files:
/tmp/tmpAaQDGA/test-1.orig/debian/changelog
/tmp/tmpAaQDGA/test-1.orig/debian/control
dpkg-source: info: use the '3.0 (quilt)' format to have separate and documented changes to upstream files, see dpkg-source(1)
dpkg-source: warning: missing information for output field Maintainer
dpkg-source: warning: missing information for output field Standards-Version
dpkg-source: info: building test in test_1-1.dsc
.ERROR:build:Debian source archive (pristine tarball) is required when you don't build the first revision of a debian package (use '--orig-tarball' option)
WARNING:root:command 'uscan --noconf --download-current-version --no-symlink --destdir /tmp/tmpW8WoA3' returned non-zero exit status 1
.warning: check: missing required meta-data: url

warning: check: missing meta-data: either (author and author_email) or (maintainer and maintainer_email) must be supplied

warning: sdist: manifest template 'MANIFEST.in' does not exist (using default file list)

warning: sdist: standard file not found: should have one of README, README.txt

..WARNING:build:enable your gpg-agent to sign packages automatically
.
*******************************************************************************
Ran 25 test cases in 1.15s (0.10s CPU), 1 errors
6 modules OK (1 failed)
failures: /tmp/tmpVZd_WE/src/271177/test/unittest_changelog [1/6]
ERROR: invocation failed (exit code 1), logfile: /tmp/tmpVZd_WE/src/271177/.tox/py27/log/py27-3.log
ERROR: actionid=py27
msg=runtests
cmdargs=['/tmp/tmpVZd_WE/src/271177/.tox/py27/bin/python', '-c', 'from logilab.common import pytest; pytest.run()', '-t', 'test']
env={'LANG': 'en_US.UTF-8', 'APYCOT_ROOT': '/tmp/tmpVZd_WE', 'LANGUAGE': 'en_US:en', 'PYTHONPATH': '/usr/share/narval:/usr/share/narval', 'HGRCPATH': '/dev/null', 'LINES': '24', 'VIRTUAL_ENV': '/tmp/tmpVZd_WE/src/271177/.tox/py27', 'PATH': '/tmp/tmpVZd_WE/src/271177/.tox/py27/bin:/usr/local/sbin:/usr/local/bin:/usr/sbin:/usr/bin:/sbin:/bin', 'PYTHONHASHSEED': '2821100692', 'HOME': '/var/lib/narval', 'LC_ALL': 'fr_FR.UTF-8', 'DISPLAY': ':1.0', 'COLUMNS': '80'}
======================= unittest_lgputils.py =======================
WARNING:root:build directory not deleted: /tmp/tmpXLoIIa
.
======================= unittest_manifest.py =======================
...
====================== unittest_changelog.py =======================
.E....
======================================================================
ERROR: test_round_trip (unittest_changelog.DebianChangeLogTC)
----------------------------------------------------------------------
Traceback (most recent call last)
File "/tmp/tmpVZd_WE/src/271177/.tox/py27/local/lib/python2.7/site-packages/logilab/common/testlib.py", line 497, in _proceed
testfunc(*args, **kwargs)
File "/tmp/tmpVZd_WE/src/271177/test/unittest_changelog.py", line 17, in test_round_trip
cl.write(out)
File "/tmp/tmpVZd_WE/src/271177/.tox/py27/local/lib/python2.7/site-packages/logilab/common/changelog.py", line 247, in write
stream.write(self.format_title())
TypeError: unicode argument expected, got 'str'

no stdout
no stderr
==================== unittest_distributions.py =====================
....
===================== unittest_architecture.py =====================
.....
======================= unittest_pkginfo.py ========================
.
======================== unittest_build.py =========================
warning: check: missing required meta-data: url

warning: check: missing meta-data: either (author and author_email) or (maintainer and maintainer_email) must be supplied

warning: sdist: manifest template 'MANIFEST.in' does not exist (using default file list)

warning: sdist: standard file not found: should have one of README, README.txt

dpkg-source: warning: no source format specified in debian/source/format, see dpkg-source(1)
dpkg-source: info: using source format `1.0'
dpkg-source: info: building test using existing test_1.orig.tar.gz
dpkg-source: info: building test in test_1-1.diff.gz
dpkg-source: warning: the diff modifies the following upstream files:
/tmp/tmpAaQDGA/test-1.orig/debian/changelog
/tmp/tmpAaQDGA/test-1.orig/debian/control
dpkg-source: info: use the '3.0 (quilt)' format to have separate and documented changes to upstream files, see dpkg-source(1)
dpkg-source: warning: missing information for output field Maintainer
dpkg-source: warning: missing information for output field Standards-Version
dpkg-source: info: building test in test_1-1.dsc
.ERROR:build:Debian source archive (pristine tarball) is required when you don't build the first revision of a debian package (use '--orig-tarball' option)
WARNING:root:command 'uscan --noconf --download-current-version --no-symlink --destdir /tmp/tmpW8WoA3' returned non-zero exit status 1
.warning: check: missing required meta-data: url

warning: check: missing meta-data: either (author and author_email) or (maintainer and maintainer_email) must be supplied

warning: sdist: manifest template 'MANIFEST.in' does not exist (using default file list)

warning: sdist: standard file not found: should have one of README, README.txt

..WARNING:build:enable your gpg-agent to sign packages automatically
.
*******************************************************************************
Ran 25 test cases in 1.15s (0.10s CPU), 1 errors
6 modules OK (1 failed)
failures: /tmp/tmpVZd_WE/src/271177/test/unittest_changelog [1/6]

ERROR: InvocationError: /tmp/tmpVZd_WE/src/271177/.tox/py27/bin/python -c from logilab.common import pytest; pytest.run() -t test (see /tmp/tmpVZd_WE/src/271177/.tox/py27/log/py27-3.log)
py34 create: /tmp/tmpVZd_WE/src/271177/.tox/py34
py34 installdeps: logilab-common, python-debian, chardet, setuptools
py34 inst: /tmp/tmpVZd_WE/src/271177/.tox/dist/logilab-packaging-1.3.1.zip
py34 runtests: PYTHONHASHSEED='2821100692'
py34 runtests: commands[0] | /tmp/tmpVZd_WE/src/271177/.tox/py34/bin/python -c from logilab.common import pytest; pytest.run() -t test
===================== unittest_architecture.py =====================
.....
======================= unittest_pkginfo.py ========================
.
==================== unittest_distributions.py =====================
....
====================== unittest_changelog.py =======================
......
======================= unittest_lgputils.py =======================
WARNING:root:build directory not deleted: /tmp/tmph1cosa0a
.
======================= unittest_manifest.py =======================
...warning: check: missing required meta-data: url

warning: check: missing meta-data: either (author and author_email) or (maintainer and maintainer_email) must be supplied

warning: sdist: manifest template 'MANIFEST.in' does not exist (using default file list)

warning: sdist: standard file not found: should have one of README, README.txt

dpkg-source: warning: no source format specified in debian/source/format, see dpkg-source(1)
dpkg-source: info: using source format `1.0'
dpkg-source: info: building test using existing test_1.orig.tar.gz
dpkg-source: info: building test in test_1-1.diff.gz
dpkg-source: warning: the diff modifies the following upstream files:
/tmp/tmp1v4p8bmt/test-1.orig/debian/changelog
/tmp/tmp1v4p8bmt/test-1.orig/debian/control
dpkg-source: info: use the '3.0 (quilt)' format to have separate and documented changes to upstream files, see dpkg-source(1)
dpkg-source: warning: missing information for output field Maintainer
dpkg-source: warning: missing information for output field Standards-Version
dpkg-source: info: building test in test_1-1.dsc

======================== unittest_build.py =========================
.ERROR:build:Debian source archive (pristine tarball) is required when you don't build the first revision of a debian package (use '--orig-tarball' option)
WARNING:root:command 'uscan --noconf --download-current-version --no-symlink --destdir /tmp/tmpawdzbr65' returned non-zero exit status 1
.warning: check: missing required meta-data: url

warning: check: missing meta-data: either (author and author_email) or (maintainer and maintainer_email) must be supplied

warning: sdist: manifest template 'MANIFEST.in' does not exist (using default file list)

warning: sdist: standard file not found: should have one of README, README.txt

..WARNING:build:enable your gpg-agent to sign packages automatically
.
*******************************************************************************
Ran 25 test cases in 2.10s (0.14s CPU)
All 7 modules OK
___________________________________ summary ____________________________________
ERROR: py27: commands failed
py34: commands succeeded
wrote json report at: /tmp/tmpVZd_WE/src/271177/tox-results.json
<br/>50 Error while running checker tox: `python2 -m tox --result-json=tox-results.json` returned with status : 1
Traceback (most recent call last):
File &quot;/tmp/tmpLqfAeg.py&quot;, line 43, in &lt;module&gt;
Command(toxw, [&#39;python2&#39;, &#39;-m&#39;, &#39;tox&#39;, &#39;--result-json=tox-results.json&#39;], raises=True, cwd=dst_dir).run()
File &quot;/usr/lib/python2.7/dist-packages/apycotlib/__init__.py&quot;, line 279, in run
self.handle_output(cmd.returncode, outfile, None)
File &quot;/usr/lib/python2.7/dist-packages/apycotlib/__init__.py&quot;, line 309, in handle_output
raise SetupException(short_msg)
SetupException: `python2 -m tox --result-json=tox-results.json` returned with status : 1
<br/>

log from execution