log_file.txt

download

20 lgp_suffix=yes
lgp_sign=yes<br/>10 use setup package class format: PackageInfo<br/>10 guessing distribution(s): jessie, trusty, wheezy, epel-6-i386, epel-7-x86_64, sid, epel-6-x86_64<br/>10 run subprocess command: python setup.py --name<br/>10 run subprocess command: python setup.py --version<br/>10 retrieve debian version from debian/changelog: 2.8.0-1<br/>20 create pristine tarball from working directory<br/>10 run subprocess command: python setup.py -q sdist -d /tmp/tmprJfQ5o<br/>10 command substitutions: {&#39;dist_dir&#39;: &#39;/tmp/tmprJfQ5o&#39;}<br/>10 copy pristine tarball to prepare Debian source package diff<br/>10 extracting original source archive for jessie distribution in /tmp/tmpPJnLv0<br/>10 suffix &#39;~rev357&#39; added to package version<br/>20 Debian source package (format: 1.0) for &#39;jessie&#39;<br/>10 running dpkg-source command: dpkg-source --no-copy -b /tmp/tmpPJnLv0/debinstall-2.8.0 ...<br/>20 create Debian source package files (.dsc, .diff.gz): debinstall_2.8.0-1~rev357.dsc<br/>20 this build is arch-independent. Lgp will only build on architecture amd64<br/>10 changing build context... (/tmp/tmpDRfh0Q)<br/>10 package builder flavour: &#39;pbuilder&#39;<br/>20 building binary debian package for &#39;jessie/amd64&#39; using DEBBUILDOPTS options: &#39;(none)&#39; ...<br/>10 running build command: sudo IMAGE=/var/cache/lgp/buildd/jessie-amd64.tgz DIST=jessie ARCH=amd64 pbuilder build --configfile /etc/lgp/pbuilderrc --buildresult /tmp/tmpDRfh0Q --hookdir /var/lib/logilab-packaging/hooks /tmp/tmpPJnLv0/debinstall_2.8.0-1~rev357.dsc ...<br/>50 binary build(s) failed for &#39;jessie&#39; with exit status 1<br/>20 a build logfile is available: /tmp/tmpeHUyUb/jessie/debinstall_2.8.0-1~rev357_amd64_jessie.lgp-build.log<br/>10 copy pristine tarball to prepare Debian source package diff<br/>10 extracting original source archive for trusty distribution in /tmp/tmp_wKXDZ<br/>10 suffix &#39;~rev357&#39; added to package version<br/>20 Debian source package (format: 1.0) for &#39;trusty&#39;<br/>10 running dpkg-source command: dpkg-source --no-copy -b /tmp/tmp_wKXDZ/debinstall-2.8.0 ...<br/>20 create Debian source package files (.dsc, .diff.gz): debinstall_2.8.0-1~rev357.dsc<br/>20 this build is arch-independent. Lgp will only build on architecture amd64<br/>10 changing build context... (/tmp/tmph9VrZB)<br/>10 package builder flavour: &#39;pbuilder&#39;<br/>20 building binary debian package for &#39;trusty/amd64&#39; using DEBBUILDOPTS options: &#39;(none)&#39; ...<br/>10 running build command: sudo IMAGE=/var/cache/lgp/buildd/trusty-amd64.tgz DIST=trusty ARCH=amd64 pbuilder build --configfile /etc/lgp/pbuilderrc --buildresult /tmp/tmph9VrZB --hookdir /var/lib/logilab-packaging/hooks /tmp/tmp_wKXDZ/debinstall_2.8.0-1~rev357.dsc ...<br/>50 binary build(s) failed for &#39;trusty&#39; with exit status 1<br/>20 a build logfile is available: /tmp/tmpeHUyUb/trusty/debinstall_2.8.0-1~rev357_amd64_trusty.lgp-build.log<br/>10 copy pristine tarball to prepare Debian source package diff<br/>10 extracting original source archive for wheezy distribution in /tmp/tmp4lrmqy<br/>10 suffix &#39;~rev357&#39; added to package version<br/>20 Debian source package (format: 1.0) for &#39;wheezy&#39;<br/>10 running dpkg-source command: dpkg-source --no-copy -b /tmp/tmp4lrmqy/debinstall-2.8.0 ...<br/>20 create Debian source package files (.dsc, .diff.gz): debinstall_2.8.0-1~rev357.dsc<br/>20 this build is arch-independent. Lgp will only build on architecture amd64<br/>10 changing build context... (/tmp/tmpvFHl7G)<br/>10 package builder flavour: &#39;pbuilder&#39;<br/>20 building binary debian package for &#39;wheezy/amd64&#39; using DEBBUILDOPTS options: &#39;(none)&#39; ...<br/>10 running build command: sudo IMAGE=/var/cache/lgp/buildd/wheezy-amd64.tgz DIST=wheezy ARCH=amd64 pbuilder build --configfile /etc/lgp/pbuilderrc --buildresult /tmp/tmpvFHl7G --hookdir /var/lib/logilab-packaging/hooks /tmp/tmp4lrmqy/debinstall_2.8.0-1~rev357.dsc ...<br/>50 binary build(s) failed for &#39;wheezy&#39; with exit status 1<br/>20 a build logfile is available: /tmp/tmpeHUyUb/wheezy/debinstall_2.8.0-1~rev357_amd64_wheezy.lgp-build.log<br/>30 unable to find the &#39;.spec&#39; file<br/>30 please use the &#39;--specfile&#39; option<br/>30 unable to find the &#39;.spec&#39; file<br/>30 please use the &#39;--specfile&#39; option<br/>10 copy pristine tarball to prepare Debian source package diff<br/>10 extracting original source archive for sid distribution in /tmp/tmp_QiS9y<br/>10 suffix &#39;~rev357&#39; added to package version<br/>20 Debian source package (format: 1.0) for &#39;sid&#39;<br/>10 running dpkg-source command: dpkg-source --no-copy -b /tmp/tmp_QiS9y/debinstall-2.8.0 ...<br/>20 create Debian source package files (.dsc, .diff.gz): debinstall_2.8.0-1~rev357.dsc<br/>20 this build is arch-independent. Lgp will only build on architecture amd64<br/>10 changing build context... (/tmp/tmps4L4XV)<br/>10 package builder flavour: &#39;pbuilder&#39;<br/>20 building binary debian package for &#39;sid/amd64&#39; using DEBBUILDOPTS options: &#39;(none)&#39; ...<br/>10 running build command: sudo IMAGE=/var/cache/lgp/buildd/sid-amd64.tgz DIST=sid ARCH=amd64 pbuilder build --configfile /etc/lgp/pbuilderrc --buildresult /tmp/tmps4L4XV --hookdir /var/lib/logilab-packaging/hooks /tmp/tmp_QiS9y/debinstall_2.8.0-1~rev357.dsc ...<br/>50 binary build(s) failed for &#39;sid&#39; with exit status 1<br/>20 a build logfile is available: /tmp/tmpeHUyUb/sid/debinstall_2.8.0-1~rev357_amd64_sid.lgp-build.log<br/>30 unable to find the &#39;.spec&#39; file<br/>30 please use the &#39;--specfile&#39; option<br/>20 recent files from build:
* /tmp/tmpeHUyUb/jessie/debinstall_2.8.0-1~rev357_amd64_jessie.lgp-build.log
* /tmp/tmpeHUyUb/sid/debinstall_2.8.0-1~rev357_amd64_sid.lgp-build.log
* /tmp/tmpeHUyUb/trusty/debinstall_2.8.0-1~rev357_amd64_trusty.lgp-build.log
* /tmp/tmpeHUyUb/wheezy/debinstall_2.8.0-1~rev357_amd64_wheezy.lgp-build.log<br/>20 begin scanning for log files <br/>20 printing /tmp/tmpeHUyUb/debinstall/../trusty/debinstall_2.8.0-1~rev357_amd64_trusty.lgp-build.log: I: Using pkgname logfile

I: Current time: Wed Dec 16 17:18:37 CET 2015

I: pbuilder-time-stamp: 1450282717

I: Obtaining the cached apt archive contents

I: Installing the build-deps

I: user script /var/cache/pbuilder/build//11216/tmp/hooks/D10tmp starting

I: user script /var/cache/pbuilder/build//11216/tmp/hooks/D10tmp finished

I: user script /var/cache/pbuilder/build//11216/tmp/hooks/D50debconf starting

I: user script /var/cache/pbuilder/build//11216/tmp/hooks/D50debconf finished

I: user script /var/cache/pbuilder/build//11216/tmp/hooks/D99apt starting

+ apt-get update

I: user script /var/cache/pbuilder/build//11216/tmp/hooks/D99apt finished

-&gt; Attempting to satisfy build-dependencies

-&gt; Creating pbuilder-satisfydepends-dummy package

Package: pbuilder-satisfydepends-dummy

Version: 0.invalid.0

Architecture: amd64

Maintainer: Debian Pbuilder Team &lt;pbuilder-maint@lists.alioth.debian.org&gt;

Description: Dummy package to satisfy dependencies with aptitude - created by pbuilder

This package was created automatically by pbuilder to satisfy the

build-dependencies of the package being currently built.

Depends: debhelper (&gt;= 9), python (&gt;= 2.6.5)

dpkg-deb: building package `pbuilder-satisfydepends-dummy&#39; in `/tmp/satisfydepends-aptitude/pbuilder-satisfydepends-dummy.deb&#39;.

Selecting previously unselected package pbuilder-satisfydepends-dummy.

(Reading database ... 12318 files and directories currently installed.)

Preparing to unpack .../pbuilder-satisfydepends-dummy.deb ...

Unpacking pbuilder-satisfydepends-dummy (0.invalid.0) ...

dpkg: pbuilder-satisfydepends-dummy: dependency problems, but configuring anyway as you requested:

pbuilder-satisfydepends-dummy depends on debhelper (&gt;= 9); however:

Package debhelper is not installed.

pbuilder-satisfydepends-dummy depends on python (&gt;= 2.6.5); however:

Package python is not installed.

Setting up pbuilder-satisfydepends-dummy (0.invalid.0) ...

Reading package lists...

Building dependency tree...

Reading state information...

Initializing package states...

Writing extended state information...

The following NEW packages will be installed:

bsdmainutils{a} debhelper{a} dh-apparmor{a} file{a} gettext{a}

gettext-base{a} groff-base{a} intltool-debian{a} libasprintf0c2{a}

libcroco3{a} libexpat1{a} libffi6{a} libglib2.0-0{a} libmagic1{a}

libpipeline1{a} libpython-stdlib{a} libpython2.7-minimal{a}

libpython2.7-stdlib{a} libunistring0{a} libxml2{a} man-db{a}

mime-support{a} po-debconf{a} python{a} python-minimal{a} python2.7{a}

python2.7-minimal{a}

0 packages upgraded, 27 newly installed, 0 to remove and 1 not upgraded.

Need to get 0 B/9909 kB of archives. After unpacking 38.9 MB will be used.

Writing extended state information...

Preconfiguring packages ...

Selecting previously unselected package libexpat1:amd64.

(Reading database ... 12318 files and directories currently installed.)

Preparing to unpack .../libexpat1_2.1.0-4ubuntu1.1_amd64.deb ...

Unpacking libexpat1:amd64 (2.1.0-4ubuntu1.1) ...

Selecting previously unselected package libffi6:amd64.

Preparing to unpack .../libffi6_3.1~rc1+r3.0.13-12ubuntu0.1_amd64.deb ...

Unpacking libffi6:amd64 (3.1~rc1+r3.0.13-12ubuntu0.1) ...

Selecting previously unselected package libmagic1:amd64.

Preparing to unpack .../libmagic1_1%3a5.14-2ubuntu3.3_amd64.deb ...

Unpacking libmagic1:amd64 (1:5.14-2ubuntu3.3) ...

Selecting previously unselected package libasprintf0c2:amd64.

Preparing to unpack .../libasprintf0c2_0.18.3.1-1ubuntu3_amd64.deb ...

Unpacking libasprintf0c2:amd64 (0.18.3.1-1ubuntu3) ...

Selecting previously unselected package libglib2.0-0:amd64.

Preparing to unpack .../libglib2.0-0_2.40.2-0ubuntu1_amd64.deb ...

Unpacking libglib2.0-0:amd64 (2.40.2-0ubuntu1) ...

Selecting previously unselected package libpipeline1:amd64.

Preparing to unpack .../libpipeline1_1.3.0-1_amd64.deb ...

Unpacking libpipeline1:amd64 (1.3.0-1) ...

Selecting previously unselected package libxml2:amd64.

Preparing to unpack .../libxml2_2.9.1+dfsg1-3ubuntu4.6_amd64.deb ...

Unpacking libxml2:amd64 (2.9.1+dfsg1-3ubuntu4.6) ...

Selecting previously unselected package groff-base.

Preparing to unpack .../groff-base_1.22.2-5_amd64.deb ...

Unpacking groff-base (1.22.2-5) ...

Selecting previously unselected package bsdmainutils.

Preparing to unpack .../bsdmainutils_9.0.5ubuntu1_amd64.deb ...

Unpacking bsdmainutils (9.0.5ubuntu1) ...

Selecting previously unselected package man-db.

Preparing to unpack .../man-db_2.6.7.1-1ubuntu1_amd64.deb ...

Unpacking man-db (2.6.7.1-1ubuntu1) ...

Selecting previously unselected package libcroco3:amd64.

Preparing to unpack .../libcroco3_0.6.8-2ubuntu1_amd64.deb ...

Unpacking libcroco3:amd64 (0.6.8-2ubuntu1) ...

Selecting previously unselected package libunistring0:amd64.

Preparing to unpack .../libunistring0_0.9.3-5ubuntu3_amd64.deb ...

Unpacking libunistring0:amd64 (0.9.3-5ubuntu3) ...

Selecting previously unselected package libpython2.7-minimal:amd64.

Preparing to unpack .../libpython2.7-minimal_2.7.6-8ubuntu0.2_amd64.deb ...

Unpacking libpython2.7-minimal:amd64 (2.7.6-8ubuntu0.2) ...

Selecting previously unselected package python2.7-minimal.

Preparing to unpack .../python2.7-minimal_2.7.6-8ubuntu0.2_amd64.deb ...

Unpacking python2.7-minimal (2.7.6-8ubuntu0.2) ...

Selecting previously unselected package file.

Preparing to unpack .../file_1%3a5.14-2ubuntu3.3_amd64.deb ...

Unpacking file (1:5.14-2ubuntu3.3) ...

Selecting previously unselected package mime-support.

Preparing to unpack .../mime-support_3.54ubuntu1.1_all.deb ...

Unpacking mime-support (3.54ubuntu1.1) ...

Selecting previously unselected package gettext-base.

Preparing to unpack .../gettext-base_0.18.3.1-1ubuntu3_amd64.deb ...

Unpacking gettext-base (0.18.3.1-1ubuntu3) ...

Selecting previously unselected package gettext.

Preparing to unpack .../gettext_0.18.3.1-1ubuntu3_amd64.deb ...

Unpacking gettext (0.18.3.1-1ubuntu3) ...

Selecting previously unselected package intltool-debian.

Preparing to unpack .../intltool-debian_0.35.0+20060710.1_all.deb ...

Unpacking intltool-debian (0.35.0+20060710.1) ...

Selecting previously unselected package po-debconf.

Preparing to unpack .../po-debconf_1.0.16+nmu2ubuntu1_all.deb ...

Unpacking po-debconf (1.0.16+nmu2ubuntu1) ...

Selecting previously unselected package dh-apparmor.

Preparing to unpack .../dh-apparmor_2.8.95~2430-0ubuntu5.3_all.deb ...

Unpacking dh-apparmor (2.8.95~2430-0ubuntu5.3) ...

Selecting previously unselected package debhelper.

Preparing to unpack .../debhelper_9.20131227ubuntu1_all.deb ...

Unpacking debhelper (9.20131227ubuntu1) ...

Selecting previously unselected package libpython2.7-stdlib:amd64.

Preparing to unpack .../libpython2.7-stdlib_2.7.6-8ubuntu0.2_amd64.deb ...

Unpacking libpython2.7-stdlib:amd64 (2.7.6-8ubuntu0.2) ...

Selecting previously unselected package libpython-stdlib:amd64.

Preparing to unpack .../libpython-stdlib_2.7.5-5ubuntu3_amd64.deb ...

Unpacking libpython-stdlib:amd64 (2.7.5-5ubuntu3) ...

Selecting previously unselected package python2.7.

Preparing to unpack .../python2.7_2.7.6-8ubuntu0.2_amd64.deb ...

Unpacking python2.7 (2.7.6-8ubuntu0.2) ...

Selecting previously unselected package python-minimal.

Preparing to unpack .../python-minimal_2.7.5-5ubuntu3_amd64.deb ...

Unpacking python-minimal (2.7.5-5ubuntu3) ...

Selecting previously unselected package python.

Preparing to unpack .../python_2.7.5-5ubuntu3_amd64.deb ...

Unpacking python (2.7.5-5ubuntu3) ...

Setting up libexpat1:amd64 (2.1.0-4ubuntu1.1) ...

Setting up libffi6:amd64 (3.1~rc1+r3.0.13-12ubuntu0.1) ...

Setting up libmagic1:amd64 (1:5.14-2ubuntu3.3) ...

Setting up libasprintf0c2:amd64 (0.18.3.1-1ubuntu3) ...

Setting up libglib2.0-0:amd64 (2.40.2-0ubuntu1) ...

No schema files found: doing nothing.

Setting up libpipeline1:amd64 (1.3.0-1) ...

Setting up libxml2:amd64 (2.9.1+dfsg1-3ubuntu4.6) ...

Setting up groff-base (1.22.2-5) ...

Setting up bsdmainutils (9.0.5ubuntu1) ...

update-alternatives: using /usr/bin/bsd-write to provide /usr/bin/write (write) in auto mode

update-alternatives: using /usr/bin/bsd-from to provide /usr/bin/from (from) in auto mode

Setting up man-db (2.6.7.1-1ubuntu1) ...

Not building database; man-db/auto-update is not &#39;true&#39;.

Setting up libcroco3:amd64 (0.6.8-2ubuntu1) ...

Setting up libunistring0:amd64 (0.9.3-5ubuntu3) ...

Setting up libpython2.7-minimal:amd64 (2.7.6-8ubuntu0.2) ...

Setting up python2.7-minimal (2.7.6-8ubuntu0.2) ...

Setting up file (1:5.14-2ubuntu3.3) ...

Setting up mime-support (3.54ubuntu1.1) ...

update-alternatives: using /usr/bin/see to provide /usr/bin/view (view) in auto mode

Setting up gettext-base (0.18.3.1-1ubuntu3) ...

Setting up gettext (0.18.3.1-1ubuntu3) ...

Setting up intltool-debian (0.35.0+20060710.1) ...

Setting up po-debconf (1.0.16+nmu2ubuntu1) ...

Setting up dh-apparmor (2.8.95~2430-0ubuntu5.3) ...

Setting up debhelper (9.20131227ubuntu1) ...

Setting up libpython2.7-stdlib:amd64 (2.7.6-8ubuntu0.2) ...

Setting up libpython-stdlib:amd64 (2.7.5-5ubuntu3) ...

Setting up python2.7 (2.7.6-8ubuntu0.2) ...

Setting up python-minimal (2.7.5-5ubuntu3) ...

Setting up python (2.7.5-5ubuntu3) ...

Processing triggers for libc-bin (2.19-0ubuntu6.6) ...

Reading package lists...

Building dependency tree...

Reading state information...

Reading extended state information...

Initializing package states...

Writing extended state information...

-&gt; Finished parsing the build-deps

Reading package lists...

Building dependency tree...

Reading state information...

apt-utils is already the newest version.

The following NEW packages will be installed:

fakeroot libfakeroot

0 upgraded, 2 newly installed, 0 to remove and 1 not upgraded.

Need to get 0 B/80.4 kB of archives.

After this operation, 415 kB of additional disk space will be used.

Selecting previously unselected package libfakeroot:amd64.

(Reading database ... 14384 files and directories currently installed.)

Preparing to unpack .../libfakeroot_1.20-3ubuntu2_amd64.deb ...

Unpacking libfakeroot:amd64 (1.20-3ubuntu2) ...

Selecting previously unselected package fakeroot.

Preparing to unpack .../fakeroot_1.20-3ubuntu2_amd64.deb ...

Unpacking fakeroot (1.20-3ubuntu2) ...

Processing triggers for man-db (2.6.7.1-1ubuntu1) ...

Not building database; man-db/auto-update is not &#39;true&#39;.

Setting up libfakeroot:amd64 (1.20-3ubuntu2) ...

Setting up fakeroot (1.20-3ubuntu2) ...

update-alternatives: using /usr/bin/fakeroot-sysv to provide /usr/bin/fakeroot (fakeroot) in auto mode

I: Copying back the cached apt archive contents

I: Copying source file

I: copying [/tmp/tmp_wKXDZ/debinstall_2.8.0-1~rev357.dsc]

I: copying [/tmp/tmp_wKXDZ/debinstall_2.8.0.orig.tar.gz]

I: copying [/tmp/tmp_wKXDZ/debinstall_2.8.0-1~rev357.diff.gz]

I: Extracting source

dpkg-source: warning: extracting unsigned source package (debinstall_2.8.0-1~rev357.dsc)

dpkg-source: info: extracting debinstall in debinstall-2.8.0

dpkg-source: info: unpacking debinstall_2.8.0.orig.tar.gz

dpkg-source: info: applying debinstall_2.8.0-1~rev357.diff.gz

I: Building the package

W: no hooks of type A found -- ignoring

I: Running cd tmp/buildd/*/ &amp;&amp; env PATH=&quot;/usr/sbin:/usr/bin:/sbin:/bin&quot; dpkg-buildpackage -us -uc -rfakeroot

dpkg-buildpackage: source package debinstall

dpkg-buildpackage: source version 2.8.0-1~rev357

dpkg-buildpackage: source distribution trusty

dpkg-buildpackage: source changed by Julien Cristau &lt;julien.cristau@logilab.fr&gt;

dpkg-source --before-build debinstall-2.8.0

dpkg-buildpackage: host architecture amd64

fakeroot debian/rules clean

dh clean --with python2

dh_testdir

dh_auto_clean

running clean

&#39;build/lib.linux-x86_64-2.7&#39; does not exist -- can&#39;t clean it

&#39;build/bdist.linux-x86_64&#39; does not exist -- can&#39;t clean it

&#39;build/scripts-2.7&#39; does not exist -- can&#39;t clean it

dh_clean

dpkg-source -b debinstall-2.8.0

dpkg-source: warning: no source format specified in debian/source/format, see dpkg-source(1)

dpkg-source: info: using source format `1.0&#39;

dpkg-source: info: building debinstall using existing debinstall_2.8.0.orig.tar.gz

dpkg-source: info: building debinstall in debinstall_2.8.0-1~rev357.diff.gz

dpkg-source: info: building debinstall in debinstall_2.8.0-1~rev357.dsc

debian/rules build

dh build --with python2

dh_testdir

dh_auto_configure

dh_auto_build

running build

running build_py

creating build

creating build/lib.linux-x86_64-2.7

creating build/lib.linux-x86_64-2.7/debinstall

copying ./ldi.py -&gt; build/lib.linux-x86_64-2.7/debinstall

copying ./__pkginfo__.py -&gt; build/lib.linux-x86_64-2.7/debinstall

copying ./__init__.py -&gt; build/lib.linux-x86_64-2.7/debinstall

copying ./debrepo.py -&gt; build/lib.linux-x86_64-2.7/debinstall

copying ./debfiles.py -&gt; build/lib.linux-x86_64-2.7/debinstall

copying ./checkers.py -&gt; build/lib.linux-x86_64-2.7/debinstall

package init file &#39;./tests/__init__.py&#39; not found (or not a regular file)

creating build/lib.linux-x86_64-2.7/debinstall/tests

copying ./tests/test_debfiles.py -&gt; build/lib.linux-x86_64-2.7/debinstall/tests

copying ./tests/test_acceptance.py -&gt; build/lib.linux-x86_64-2.7/debinstall/tests

package init file &#39;./tests/__init__.py&#39; not found (or not a regular file)

running build_scripts

creating build/scripts-2.7

copying and adjusting bin/ldi -&gt; build/scripts-2.7

changing mode of build/scripts-2.7/ldi from 644 to 755

dh_auto_test

fakeroot debian/rules binary

dh binary --with python2

dh_testroot

dh_prep

dh_auto_install

running install

running build

running build_py

package init file &#39;./tests/__init__.py&#39; not found (or not a regular file)

package init file &#39;./tests/__init__.py&#39; not found (or not a regular file)

running build_scripts

running install_lib

creating /tmp/buildd/debinstall-2.8.0/debian/debinstall/usr

creating /tmp/buildd/debinstall-2.8.0/debian/debinstall/usr/lib

creating /tmp/buildd/debinstall-2.8.0/debian/debinstall/usr/lib/python2.7

creating /tmp/buildd/debinstall-2.8.0/debian/debinstall/usr/lib/python2.7/dist-packages

creating /tmp/buildd/debinstall-2.8.0/debian/debinstall/usr/lib/python2.7/dist-packages/debinstall

copying build/lib.linux-x86_64-2.7/debinstall/ldi.py -&gt; /tmp/buildd/debinstall-2.8.0/debian/debinstall/usr/lib/python2.7/dist-packages/debinstall

copying build/lib.linux-x86_64-2.7/debinstall/__pkginfo__.py -&gt; /tmp/buildd/debinstall-2.8.0/debian/debinstall/usr/lib/python2.7/dist-packages/debinstall

copying build/lib.linux-x86_64-2.7/debinstall/__init__.py -&gt; /tmp/buildd/debinstall-2.8.0/debian/debinstall/usr/lib/python2.7/dist-packages/debinstall

creating /tmp/buildd/debinstall-2.8.0/debian/debinstall/usr/lib/python2.7/dist-packages/debinstall/tests

copying build/lib.linux-x86_64-2.7/debinstall/tests/test_debfiles.py -&gt; /tmp/buildd/debinstall-2.8.0/debian/debinstall/usr/lib/python2.7/dist-packages/debinstall/tests

copying build/lib.linux-x86_64-2.7/debinstall/tests/test_acceptance.py -&gt; /tmp/buildd/debinstall-2.8.0/debian/debinstall/usr/lib/python2.7/dist-packages/debinstall/tests

copying build/lib.linux-x86_64-2.7/debinstall/debrepo.py -&gt; /tmp/buildd/debinstall-2.8.0/debian/debinstall/usr/lib/python2.7/dist-packages/debinstall

copying build/lib.linux-x86_64-2.7/debinstall/debfiles.py -&gt; /tmp/buildd/debinstall-2.8.0/debian/debinstall/usr/lib/python2.7/dist-packages/debinstall

copying build/lib.linux-x86_64-2.7/debinstall/checkers.py -&gt; /tmp/buildd/debinstall-2.8.0/debian/debinstall/usr/lib/python2.7/dist-packages/debinstall

running install_scripts

creating /tmp/buildd/debinstall-2.8.0/debian/debinstall/usr/bin

copying build/scripts-2.7/ldi -&gt; /tmp/buildd/debinstall-2.8.0/debian/debinstall/usr/bin

changing mode of /tmp/buildd/debinstall-2.8.0/debian/debinstall/usr/bin/ldi to 755

running install_egg_info

Writing /tmp/buildd/debinstall-2.8.0/debian/debinstall/usr/lib/python2.7/dist-packages/debinstall-2.8.0.egg-info

tests/packages/signed_no_source -&gt; /tmp/buildd/debinstall-2.8.0/debian/debinstall/usr/lib/python2.7/dist-packages/debinstall/tests/packages/signed_no_source

tests/packages/signed_package -&gt; /tmp/buildd/debinstall-2.8.0/debian/debinstall/usr/lib/python2.7/dist-packages/debinstall/tests/packages/signed_package

tests/packages/unsigned_package -&gt; /tmp/buildd/debinstall-2.8.0/debian/debinstall/usr/lib/python2.7/dist-packages/debinstall/tests/packages/unsigned_package

tests/packages/signed_package_rev2 -&gt; /tmp/buildd/debinstall-2.8.0/debian/debinstall/usr/lib/python2.7/dist-packages/debinstall/tests/packages/signed_package_rev2

tests/packages/signed_no_source/package1_1.0-1_i386.changes -&gt; /tmp/buildd/debinstall-2.8.0/debian/debinstall/usr/lib/python2.7/dist-packages/debinstall/tests/packages/signed_no_source/package1_1.0-1_i386.changes

tests/packages/signed_no_source/package1_1.0-1_all.deb -&gt; /tmp/buildd/debinstall-2.8.0/debian/debinstall/usr/lib/python2.7/dist-packages/debinstall/tests/packages/signed_no_source/package1_1.0-1_all.deb

tests/packages/signed_package/package1_1.0-1.dsc -&gt; /tmp/buildd/debinstall-2.8.0/debian/debinstall/usr/lib/python2.7/dist-packages/debinstall/tests/packages/signed_package/package1_1.0-1.dsc

tests/packages/signed_package/package1_1.0-1.diff.gz -&gt; /tmp/buildd/debinstall-2.8.0/debian/debinstall/usr/lib/python2.7/dist-packages/debinstall/tests/packages/signed_package/package1_1.0-1.diff.gz

tests/packages/signed_package/package1_1.0-1_i386.changes -&gt; /tmp/buildd/debinstall-2.8.0/debian/debinstall/usr/lib/python2.7/dist-packages/debinstall/tests/packages/signed_package/package1_1.0-1_i386.changes

tests/packages/signed_package/package1_1.0-1_all.deb -&gt; /tmp/buildd/debinstall-2.8.0/debian/debinstall/usr/lib/python2.7/dist-packages/debinstall/tests/packages/signed_package/package1_1.0-1_all.deb

tests/packages/signed_package/package1_1.0.orig.tar.gz -&gt; /tmp/buildd/debinstall-2.8.0/debian/debinstall/usr/lib/python2.7/dist-packages/debinstall/tests/packages/signed_package/package1_1.0.orig.tar.gz

tests/packages/unsigned_package/package1_1.0-1.dsc -&gt; /tmp/buildd/debinstall-2.8.0/debian/debinstall/usr/lib/python2.7/dist-packages/debinstall/tests/packages/unsigned_package/package1_1.0-1.dsc

tests/packages/unsigned_package/package1_1.0-1.diff.gz -&gt; /tmp/buildd/debinstall-2.8.0/debian/debinstall/usr/lib/python2.7/dist-packages/debinstall/tests/packages/unsigned_package/package1_1.0-1.diff.gz

tests/packages/unsigned_package/package1_1.0-1_i386.changes -&gt; /tmp/buildd/debinstall-2.8.0/debian/debinstall/usr/lib/python2.7/dist-packages/debinstall/tests/packages/unsigned_package/package1_1.0-1_i386.changes

tests/packages/unsigned_package/package1_1.0-1_all.deb -&gt; /tmp/buildd/debinstall-2.8.0/debian/debinstall/usr/lib/python2.7/dist-packages/debinstall/tests/packages/unsigned_package/package1_1.0-1_all.deb

tests/packages/unsigned_package/package1_1.0.orig.tar.gz -&gt; /tmp/buildd/debinstall-2.8.0/debian/debinstall/usr/lib/python2.7/dist-packages/debinstall/tests/packages/unsigned_package/package1_1.0.orig.tar.gz

tests/packages/signed_package_rev2/package1_1.0-2.diff.gz -&gt; /tmp/buildd/debinstall-2.8.0/debian/debinstall/usr/lib/python2.7/dist-packages/debinstall/tests/packages/signed_package_rev2/package1_1.0-2.diff.gz

tests/packages/signed_package_rev2/package1_1.0-2_i386.changes -&gt; /tmp/buildd/debinstall-2.8.0/debian/debinstall/usr/lib/python2.7/dist-packages/debinstall/tests/packages/signed_package_rev2/package1_1.0-2_i386.changes

tests/packages/signed_package_rev2/package1_1.0-2.dsc -&gt; /tmp/buildd/debinstall-2.8.0/debian/debinstall/usr/lib/python2.7/dist-packages/debinstall/tests/packages/signed_package_rev2/package1_1.0-2.dsc

tests/packages/signed_package_rev2/package1_1.0-2_i386.build -&gt; /tmp/buildd/debinstall-2.8.0/debian/debinstall/usr/lib/python2.7/dist-packages/debinstall/tests/packages/signed_package_rev2/package1_1.0-2_i386.build

tests/packages/signed_package_rev2/package1_1.0-2_all.deb -&gt; /tmp/buildd/debinstall-2.8.0/debian/debinstall/usr/lib/python2.7/dist-packages/debinstall/tests/packages/signed_package_rev2/package1_1.0-2_all.deb

dh_install

cp: cannot stat &#39;debian/tmp/usr/lib&#39;: No such file or directory

dh_install: cp -a debian/tmp/usr/lib debian/debinstall//usr/ returned exit code 1

make: *** [binary] Error 2

dpkg-buildpackage: error: fakeroot debian/rules binary gave error exit status 2

E: Failed autobuilding of package

I: user script /var/cache/pbuilder/build//11216/tmp/hooks/C10shell starting

If you want to enter into the chroot image to debug, you have to edit your ~/.pbuilderrc with:

export LGP_AUTO_ENTER_SHELL=y

I: user script /var/cache/pbuilder/build//11216/tmp/hooks/C10shell finished

I: unmounting /sys filesystem

I: unmounting /dev filesystem

I: unmounting dev/pts filesystem

I: unmounting run/shm filesystem

I: unmounting proc filesystem

I: cleaning the build env

I: removing directory /var/cache/pbuilder/build//11216 and its subdirectories
<br/>20 printing /tmp/tmpeHUyUb/debinstall/../sid/debinstall_2.8.0-1~rev357_amd64_sid.lgp-build.log: I: Using pkgname logfile

I: Current time: Wed Dec 16 17:19:15 CET 2015

I: pbuilder-time-stamp: 1450282755

I: Obtaining the cached apt archive contents

I: Installing the build-deps

I: user script /var/cache/pbuilder/build//13373/tmp/hooks/D10tmp starting

I: user script /var/cache/pbuilder/build//13373/tmp/hooks/D10tmp finished

I: user script /var/cache/pbuilder/build//13373/tmp/hooks/D50debconf starting

I: user script /var/cache/pbuilder/build//13373/tmp/hooks/D50debconf finished

I: user script /var/cache/pbuilder/build//13373/tmp/hooks/D99apt starting

+ apt-get update

I: user script /var/cache/pbuilder/build//13373/tmp/hooks/D99apt finished

-&gt; Attempting to satisfy build-dependencies

-&gt; Creating pbuilder-satisfydepends-dummy package

Package: pbuilder-satisfydepends-dummy

Version: 0.invalid.0

Architecture: amd64

Maintainer: Debian Pbuilder Team &lt;pbuilder-maint@lists.alioth.debian.org&gt;

Description: Dummy package to satisfy dependencies with aptitude - created by pbuilder

This package was created automatically by pbuilder to satisfy the

build-dependencies of the package being currently built.

Depends: debhelper (&gt;= 9), python (&gt;= 2.6.5)

dpkg-deb: building package &#39;pbuilder-satisfydepends-dummy&#39; in &#39;/tmp/satisfydepends-aptitude/pbuilder-satisfydepends-dummy.deb&#39;.

Selecting previously unselected package pbuilder-satisfydepends-dummy.

(Reading database ... 12829 files and directories currently installed.)

Preparing to unpack .../pbuilder-satisfydepends-dummy.deb ...

Unpacking pbuilder-satisfydepends-dummy (0.invalid.0) ...

dpkg: pbuilder-satisfydepends-dummy: dependency problems, but configuring anyway as you requested:

pbuilder-satisfydepends-dummy depends on debhelper (&gt;= 9); however:

Package debhelper is not installed.

pbuilder-satisfydepends-dummy depends on python (&gt;= 2.6.5); however:

Package python is not installed.

Setting up pbuilder-satisfydepends-dummy (0.invalid.0) ...

Reading package lists...

Building dependency tree...

Reading state information...

Initializing package states...

Writing extended state information...

Building tag database...

pbuilder-satisfydepends-dummy is already installed at the requested version (0.invalid.0)

pbuilder-satisfydepends-dummy is already installed at the requested version (0.invalid.0)

The following NEW packages will be installed:

bsdmainutils{a} debhelper{a} dh-strip-nondeterminism{a} file{a}

gettext{a} gettext-base{a} groff-base{a} intltool-debian{a}

libarchive-zip-perl{a} libcroco3{a} libexpat1{a}

libfile-stripnondeterminism-perl{a} libglib2.0-0{a} libmagic1{a}

libpipeline1{a} libpython-stdlib{a} libpython2.7-minimal{a}

libpython2.7-stdlib{a} libunistring0{a} libxml2{a} man-db{a}

mime-support{a} po-debconf{a} python{a} python-minimal{a} python2.7{a}

python2.7-minimal{a}

The following packages are RECOMMENDED but will NOT be installed:

libglib2.0-data libmail-sendmail-perl shared-mime-info xdg-user-dirs

xml-core

0 packages upgraded, 27 newly installed, 0 to remove and 0 not upgraded.

Need to get 0 B/13.7 MB of archives. After unpacking 46.2 MB will be used.

Writing extended state information...

Preconfiguring packages ...

E: Can not write log (Is /dev/pts mounted?) - posix_openpt (2: No such file or directory)

Selecting previously unselected package groff-base.

(Reading database ... 12829 files and directories currently installed.)

Preparing to unpack .../groff-base_1.22.3-4_amd64.deb ...

Unpacking groff-base (1.22.3-4) ...

Selecting previously unselected package bsdmainutils.

Preparing to unpack .../bsdmainutils_9.0.6+b1_amd64.deb ...

Unpacking bsdmainutils (9.0.6+b1) ...

Selecting previously unselected package libpipeline1:amd64.

Preparing to unpack .../libpipeline1_1.4.1-1_amd64.deb ...

Unpacking libpipeline1:amd64 (1.4.1-1) ...

Selecting previously unselected package man-db.

Preparing to unpack .../man-db_2.7.5-1_amd64.deb ...

Unpacking man-db (2.7.5-1) ...

Selecting previously unselected package libpython2.7-minimal:amd64.

Preparing to unpack .../libpython2.7-minimal_2.7.11-2_amd64.deb ...

Unpacking libpython2.7-minimal:amd64 (2.7.11-2) ...

Selecting previously unselected package python2.7-minimal.

Preparing to unpack .../python2.7-minimal_2.7.11-2_amd64.deb ...

Unpacking python2.7-minimal (2.7.11-2) ...

Selecting previously unselected package python-minimal.

Preparing to unpack .../python-minimal_2.7.11-1_amd64.deb ...

Unpacking python-minimal (2.7.11-1) ...

Selecting previously unselected package mime-support.

Preparing to unpack .../mime-support_3.59_all.deb ...

Unpacking mime-support (3.59) ...

Selecting previously unselected package libexpat1:amd64.

Preparing to unpack .../libexpat1_2.1.0-7_amd64.deb ...

Unpacking libexpat1:amd64 (2.1.0-7) ...

Selecting previously unselected package libpython2.7-stdlib:amd64.

Preparing to unpack .../libpython2.7-stdlib_2.7.11-2_amd64.deb ...

Unpacking libpython2.7-stdlib:amd64 (2.7.11-2) ...

Selecting previously unselected package python2.7.

Preparing to unpack .../python2.7_2.7.11-2_amd64.deb ...

Unpacking python2.7 (2.7.11-2) ...

Selecting previously unselected package libpython-stdlib:amd64.

Preparing to unpack .../libpython-stdlib_2.7.11-1_amd64.deb ...

Unpacking libpython-stdlib:amd64 (2.7.11-1) ...

Setting up libpython2.7-minimal:amd64 (2.7.11-2) ...

Setting up python2.7-minimal (2.7.11-2) ...

Setting up python-minimal (2.7.11-1) ...

Selecting previously unselected package python.

(Reading database ... 14158 files and directories currently installed.)

Preparing to unpack .../python_2.7.11-1_amd64.deb ...

Unpacking python (2.7.11-1) ...

Selecting previously unselected package libunistring0:amd64.

Preparing to unpack .../libunistring0_0.9.3-5.2+b1_amd64.deb ...

Unpacking libunistring0:amd64 (0.9.3-5.2+b1) ...

Selecting previously unselected package libmagic1:amd64.

Preparing to unpack .../libmagic1_1%3a5.25-2_amd64.deb ...

Unpacking libmagic1:amd64 (1:5.25-2) ...

Selecting previously unselected package file.

Preparing to unpack .../file_1%3a5.25-2_amd64.deb ...

Unpacking file (1:5.25-2) ...

Selecting previously unselected package gettext-base.

Preparing to unpack .../gettext-base_0.19.6-1_amd64.deb ...

Unpacking gettext-base (0.19.6-1) ...

Selecting previously unselected package libxml2:amd64.

Preparing to unpack .../libxml2_2.9.3+dfsg1-1_amd64.deb ...

Unpacking libxml2:amd64 (2.9.3+dfsg1-1) ...

Selecting previously unselected package libglib2.0-0:amd64.

Preparing to unpack .../libglib2.0-0_2.46.2-1_amd64.deb ...

Unpacking libglib2.0-0:amd64 (2.46.2-1) ...

Selecting previously unselected package libcroco3:amd64.

Preparing to unpack .../libcroco3_0.6.10-1_amd64.deb ...

Unpacking libcroco3:amd64 (0.6.10-1) ...

Selecting previously unselected package gettext.

Preparing to unpack .../gettext_0.19.6-1_amd64.deb ...

Unpacking gettext (0.19.6-1) ...

Selecting previously unselected package intltool-debian.

Preparing to unpack .../intltool-debian_0.35.0+20060710.4_all.deb ...

Unpacking intltool-debian (0.35.0+20060710.4) ...

Selecting previously unselected package po-debconf.

Preparing to unpack .../po-debconf_1.0.18_all.deb ...

Unpacking po-debconf (1.0.18) ...

Selecting previously unselected package libarchive-zip-perl.

Preparing to unpack .../libarchive-zip-perl_1.55-1_all.deb ...

Unpacking libarchive-zip-perl (1.55-1) ...

Selecting previously unselected package libfile-stripnondeterminism-perl.

Preparing to unpack .../libfile-stripnondeterminism-perl_0.014-1_all.deb ...

Unpacking libfile-stripnondeterminism-perl (0.014-1) ...

Selecting previously unselected package dh-strip-nondeterminism.

Preparing to unpack .../dh-strip-nondeterminism_0.014-1_all.deb ...

Unpacking dh-strip-nondeterminism (0.014-1) ...

Selecting previously unselected package debhelper.

Preparing to unpack .../debhelper_9.20151126_all.deb ...

Unpacking debhelper (9.20151126) ...

Processing triggers for libc-bin (2.21-4) ...

Setting up groff-base (1.22.3-4) ...

Setting up bsdmainutils (9.0.6+b1) ...

update-alternatives: using /usr/bin/bsd-write to provide /usr/bin/write (write) in auto mode

update-alternatives: using /usr/bin/bsd-from to provide /usr/bin/from (from) in auto mode

Setting up libpipeline1:amd64 (1.4.1-1) ...

Setting up man-db (2.7.5-1) ...

Not building database; man-db/auto-update is not &#39;true&#39;.

Setting up mime-support (3.59) ...

Setting up libexpat1:amd64 (2.1.0-7) ...

Setting up libpython2.7-stdlib:amd64 (2.7.11-2) ...

Setting up python2.7 (2.7.11-2) ...

Setting up libpython-stdlib:amd64 (2.7.11-1) ...

Setting up python (2.7.11-1) ...

Setting up libunistring0:amd64 (0.9.3-5.2+b1) ...

Setting up libmagic1:amd64 (1:5.25-2) ...

Setting up file (1:5.25-2) ...

Setting up gettext-base (0.19.6-1) ...

Setting up libxml2:amd64 (2.9.3+dfsg1-1) ...

Setting up libglib2.0-0:amd64 (2.46.2-1) ...

No schema files found: doing nothing.

Setting up libcroco3:amd64 (0.6.10-1) ...

Setting up gettext (0.19.6-1) ...

Setting up intltool-debian (0.35.0+20060710.4) ...

Setting up po-debconf (1.0.18) ...

Setting up libarchive-zip-perl (1.55-1) ...

Setting up libfile-stripnondeterminism-perl (0.014-1) ...

Setting up dh-strip-nondeterminism (0.014-1) ...

Setting up debhelper (9.20151126) ...

Processing triggers for libc-bin (2.21-4) ...

Reading package lists...

Building dependency tree...

Reading state information...

Reading extended state information...

Initializing package states...

Writing extended state information...

Building tag database...

-&gt; Finished parsing the build-deps

Reading package lists...

Building dependency tree...

Reading state information...

apt-utils is already the newest version (1.1.5).

The following NEW packages will be installed:

fakeroot libfakeroot

0 upgraded, 2 newly installed, 0 to remove and 0 not upgraded.

Need to get 0 B/129 kB of archives.

After this operation, 434 kB of additional disk space will be used.

E: Can not write log (Is /dev/pts mounted?) - posix_openpt (2: No such file or directory)

Selecting previously unselected package libfakeroot:amd64.

(Reading database ... 15166 files and directories currently installed.)

Preparing to unpack .../libfakeroot_1.20.2-1_amd64.deb ...

Unpacking libfakeroot:amd64 (1.20.2-1) ...

Selecting previously unselected package fakeroot.

Preparing to unpack .../fakeroot_1.20.2-1_amd64.deb ...

Unpacking fakeroot (1.20.2-1) ...

Processing triggers for man-db (2.7.5-1) ...

Not building database; man-db/auto-update is not &#39;true&#39;.

Setting up libfakeroot:amd64 (1.20.2-1) ...

Setting up fakeroot (1.20.2-1) ...

update-alternatives: using /usr/bin/fakeroot-sysv to provide /usr/bin/fakeroot (fakeroot) in auto mode

I: Copying back the cached apt archive contents

I: Copying source file

I: copying [/tmp/tmp_QiS9y/debinstall_2.8.0-1~rev357.dsc]

I: copying [/tmp/tmp_QiS9y/debinstall_2.8.0.orig.tar.gz]

I: copying [/tmp/tmp_QiS9y/debinstall_2.8.0-1~rev357.diff.gz]

I: Extracting source

dpkg-source: warning: extracting unsigned source package (debinstall_2.8.0-1~rev357.dsc)

dpkg-source: info: extracting debinstall in debinstall-2.8.0

dpkg-source: info: unpacking debinstall_2.8.0.orig.tar.gz

dpkg-source: info: applying debinstall_2.8.0-1~rev357.diff.gz

I: Building the package

W: no hooks of type A found -- ignoring

I: Running cd tmp/buildd/*/ &amp;&amp; env PATH=&quot;/usr/sbin:/usr/bin:/sbin:/bin&quot; dpkg-buildpackage -us -uc -rfakeroot

dpkg-buildpackage: source package debinstall

dpkg-buildpackage: source version 2.8.0-1~rev357

dpkg-buildpackage: source distribution sid

dpkg-buildpackage: source changed by Julien Cristau &lt;julien.cristau@logilab.fr&gt;

dpkg-source --before-build debinstall-2.8.0

dpkg-buildpackage: host architecture amd64

fakeroot debian/rules clean

dh clean --with python2

dh_testdir

dh_auto_clean

python setup.py clean -a

running clean

&#39;build/lib.linux-x86_64-2.7&#39; does not exist -- can&#39;t clean it

&#39;build/bdist.linux-x86_64&#39; does not exist -- can&#39;t clean it

&#39;build/scripts-2.7&#39; does not exist -- can&#39;t clean it

find . -name \*.pyc -exec rm {} \+

dh_clean

dpkg-source -b debinstall-2.8.0

dpkg-source: warning: no source format specified in debian/source/format, see dpkg-source(1)

dpkg-source: info: using source format &#39;1.0&#39;

dpkg-source: info: building debinstall using existing debinstall_2.8.0.orig.tar.gz

dpkg-source: info: building debinstall in debinstall_2.8.0-1~rev357.diff.gz

dpkg-source: info: building debinstall in debinstall_2.8.0-1~rev357.dsc

debian/rules build

dh build --with python2

dh_testdir

dh_auto_configure

dh_auto_build

python setup.py build --force

running build

running build_py

creating build

creating build/lib.linux-x86_64-2.7

creating build/lib.linux-x86_64-2.7/debinstall

copying ./ldi.py -&gt; build/lib.linux-x86_64-2.7/debinstall

copying ./__pkginfo__.py -&gt; build/lib.linux-x86_64-2.7/debinstall

copying ./__init__.py -&gt; build/lib.linux-x86_64-2.7/debinstall

copying ./debrepo.py -&gt; build/lib.linux-x86_64-2.7/debinstall

copying ./debfiles.py -&gt; build/lib.linux-x86_64-2.7/debinstall

copying ./checkers.py -&gt; build/lib.linux-x86_64-2.7/debinstall

package init file &#39;./tests/__init__.py&#39; not found (or not a regular file)

creating build/lib.linux-x86_64-2.7/debinstall/tests

copying ./tests/test_debfiles.py -&gt; build/lib.linux-x86_64-2.7/debinstall/tests

copying ./tests/test_acceptance.py -&gt; build/lib.linux-x86_64-2.7/debinstall/tests

package init file &#39;./tests/__init__.py&#39; not found (or not a regular file)

running build_scripts

creating build/scripts-2.7

copying and adjusting bin/ldi -&gt; build/scripts-2.7

changing mode of build/scripts-2.7/ldi from 644 to 755

dh_auto_test

fakeroot debian/rules binary

dh binary --with python2

dh_testroot

dh_prep

dh_auto_install

python setup.py install --force --root=/tmp/buildd/debinstall-2.8.0/debian/debinstall --no-compile -O0 --install-layout=deb

running install

running build

running build_py

package init file &#39;./tests/__init__.py&#39; not found (or not a regular file)

package init file &#39;./tests/__init__.py&#39; not found (or not a regular file)

running build_scripts

running install_lib

creating /tmp/buildd/debinstall-2.8.0/debian/debinstall/usr

creating /tmp/buildd/debinstall-2.8.0/debian/debinstall/usr/lib

creating /tmp/buildd/debinstall-2.8.0/debian/debinstall/usr/lib/python2.7

creating /tmp/buildd/debinstall-2.8.0/debian/debinstall/usr/lib/python2.7/dist-packages

creating /tmp/buildd/debinstall-2.8.0/debian/debinstall/usr/lib/python2.7/dist-packages/debinstall

copying build/lib.linux-x86_64-2.7/debinstall/ldi.py -&gt; /tmp/buildd/debinstall-2.8.0/debian/debinstall/usr/lib/python2.7/dist-packages/debinstall

copying build/lib.linux-x86_64-2.7/debinstall/__pkginfo__.py -&gt; /tmp/buildd/debinstall-2.8.0/debian/debinstall/usr/lib/python2.7/dist-packages/debinstall

copying build/lib.linux-x86_64-2.7/debinstall/__init__.py -&gt; /tmp/buildd/debinstall-2.8.0/debian/debinstall/usr/lib/python2.7/dist-packages/debinstall

creating /tmp/buildd/debinstall-2.8.0/debian/debinstall/usr/lib/python2.7/dist-packages/debinstall/tests

copying build/lib.linux-x86_64-2.7/debinstall/tests/test_debfiles.py -&gt; /tmp/buildd/debinstall-2.8.0/debian/debinstall/usr/lib/python2.7/dist-packages/debinstall/tests

copying build/lib.linux-x86_64-2.7/debinstall/tests/test_acceptance.py -&gt; /tmp/buildd/debinstall-2.8.0/debian/debinstall/usr/lib/python2.7/dist-packages/debinstall/tests

copying build/lib.linux-x86_64-2.7/debinstall/debrepo.py -&gt; /tmp/buildd/debinstall-2.8.0/debian/debinstall/usr/lib/python2.7/dist-packages/debinstall

copying build/lib.linux-x86_64-2.7/debinstall/debfiles.py -&gt; /tmp/buildd/debinstall-2.8.0/debian/debinstall/usr/lib/python2.7/dist-packages/debinstall

copying build/lib.linux-x86_64-2.7/debinstall/checkers.py -&gt; /tmp/buildd/debinstall-2.8.0/debian/debinstall/usr/lib/python2.7/dist-packages/debinstall

running install_scripts

creating /tmp/buildd/debinstall-2.8.0/debian/debinstall/usr/bin

copying build/scripts-2.7/ldi -&gt; /tmp/buildd/debinstall-2.8.0/debian/debinstall/usr/bin

changing mode of /tmp/buildd/debinstall-2.8.0/debian/debinstall/usr/bin/ldi to 755

running install_egg_info

Writing /tmp/buildd/debinstall-2.8.0/debian/debinstall/usr/lib/python2.7/dist-packages/debinstall-2.8.0.egg-info

tests/packages/signed_no_source -&gt; /tmp/buildd/debinstall-2.8.0/debian/debinstall/usr/lib/python2.7/dist-packages/debinstall/tests/packages/signed_no_source

tests/packages/signed_package -&gt; /tmp/buildd/debinstall-2.8.0/debian/debinstall/usr/lib/python2.7/dist-packages/debinstall/tests/packages/signed_package

tests/packages/unsigned_package -&gt; /tmp/buildd/debinstall-2.8.0/debian/debinstall/usr/lib/python2.7/dist-packages/debinstall/tests/packages/unsigned_package

tests/packages/signed_package_rev2 -&gt; /tmp/buildd/debinstall-2.8.0/debian/debinstall/usr/lib/python2.7/dist-packages/debinstall/tests/packages/signed_package_rev2

tests/packages/signed_no_source/package1_1.0-1_i386.changes -&gt; /tmp/buildd/debinstall-2.8.0/debian/debinstall/usr/lib/python2.7/dist-packages/debinstall/tests/packages/signed_no_source/package1_1.0-1_i386.changes

tests/packages/signed_no_source/package1_1.0-1_all.deb -&gt; /tmp/buildd/debinstall-2.8.0/debian/debinstall/usr/lib/python2.7/dist-packages/debinstall/tests/packages/signed_no_source/package1_1.0-1_all.deb

tests/packages/signed_package/package1_1.0-1.dsc -&gt; /tmp/buildd/debinstall-2.8.0/debian/debinstall/usr/lib/python2.7/dist-packages/debinstall/tests/packages/signed_package/package1_1.0-1.dsc

tests/packages/signed_package/package1_1.0-1.diff.gz -&gt; /tmp/buildd/debinstall-2.8.0/debian/debinstall/usr/lib/python2.7/dist-packages/debinstall/tests/packages/signed_package/package1_1.0-1.diff.gz

tests/packages/signed_package/package1_1.0-1_i386.changes -&gt; /tmp/buildd/debinstall-2.8.0/debian/debinstall/usr/lib/python2.7/dist-packages/debinstall/tests/packages/signed_package/package1_1.0-1_i386.changes

tests/packages/signed_package/package1_1.0-1_all.deb -&gt; /tmp/buildd/debinstall-2.8.0/debian/debinstall/usr/lib/python2.7/dist-packages/debinstall/tests/packages/signed_package/package1_1.0-1_all.deb

tests/packages/signed_package/package1_1.0.orig.tar.gz -&gt; /tmp/buildd/debinstall-2.8.0/debian/debinstall/usr/lib/python2.7/dist-packages/debinstall/tests/packages/signed_package/package1_1.0.orig.tar.gz

tests/packages/unsigned_package/package1_1.0-1.dsc -&gt; /tmp/buildd/debinstall-2.8.0/debian/debinstall/usr/lib/python2.7/dist-packages/debinstall/tests/packages/unsigned_package/package1_1.0-1.dsc

tests/packages/unsigned_package/package1_1.0-1.diff.gz -&gt; /tmp/buildd/debinstall-2.8.0/debian/debinstall/usr/lib/python2.7/dist-packages/debinstall/tests/packages/unsigned_package/package1_1.0-1.diff.gz

tests/packages/unsigned_package/package1_1.0-1_i386.changes -&gt; /tmp/buildd/debinstall-2.8.0/debian/debinstall/usr/lib/python2.7/dist-packages/debinstall/tests/packages/unsigned_package/package1_1.0-1_i386.changes

tests/packages/unsigned_package/package1_1.0-1_all.deb -&gt; /tmp/buildd/debinstall-2.8.0/debian/debinstall/usr/lib/python2.7/dist-packages/debinstall/tests/packages/unsigned_package/package1_1.0-1_all.deb

tests/packages/unsigned_package/package1_1.0.orig.tar.gz -&gt; /tmp/buildd/debinstall-2.8.0/debian/debinstall/usr/lib/python2.7/dist-packages/debinstall/tests/packages/unsigned_package/package1_1.0.orig.tar.gz

tests/packages/signed_package_rev2/package1_1.0-2.diff.gz -&gt; /tmp/buildd/debinstall-2.8.0/debian/debinstall/usr/lib/python2.7/dist-packages/debinstall/tests/packages/signed_package_rev2/package1_1.0-2.diff.gz

tests/packages/signed_package_rev2/package1_1.0-2_i386.changes -&gt; /tmp/buildd/debinstall-2.8.0/debian/debinstall/usr/lib/python2.7/dist-packages/debinstall/tests/packages/signed_package_rev2/package1_1.0-2_i386.changes

tests/packages/signed_package_rev2/package1_1.0-2.dsc -&gt; /tmp/buildd/debinstall-2.8.0/debian/debinstall/usr/lib/python2.7/dist-packages/debinstall/tests/packages/signed_package_rev2/package1_1.0-2.dsc

tests/packages/signed_package_rev2/package1_1.0-2_i386.build -&gt; /tmp/buildd/debinstall-2.8.0/debian/debinstall/usr/lib/python2.7/dist-packages/debinstall/tests/packages/signed_package_rev2/package1_1.0-2_i386.build

tests/packages/signed_package_rev2/package1_1.0-2_all.deb -&gt; /tmp/buildd/debinstall-2.8.0/debian/debinstall/usr/lib/python2.7/dist-packages/debinstall/tests/packages/signed_package_rev2/package1_1.0-2_all.deb

dh_install

cp: cannot stat &#39;debian/tmp/usr/lib&#39;: No such file or directory

dh_install: cp --reflink=auto -a debian/tmp/usr/lib debian/debinstall//usr/ returned exit code 1

debian/rules:4: recipe for target &#39;binary&#39; failed

make: *** [binary] Error 2

dpkg-buildpackage: error: fakeroot debian/rules binary gave error exit status 2

E: Failed autobuilding of package

I: user script /var/cache/pbuilder/build//13373/tmp/hooks/C10shell starting

If you want to enter into the chroot image to debug, you have to edit your ~/.pbuilderrc with:

export LGP_AUTO_ENTER_SHELL=y

I: user script /var/cache/pbuilder/build//13373/tmp/hooks/C10shell finished

I: unmounting /sys filesystem

I: unmounting /dev filesystem

I: unmounting dev/pts filesystem

I: unmounting run/shm filesystem

I: unmounting proc filesystem

I: cleaning the build env

I: removing directory /var/cache/pbuilder/build//13373 and its subdirectories
<br/>20 printing /tmp/tmpeHUyUb/debinstall/../wheezy/debinstall_2.8.0-1~rev357_amd64_wheezy.lgp-build.log: I: Using pkgname logfile

I: Current time: Wed Dec 16 17:18:54 CET 2015

I: pbuilder-time-stamp: 1450282734

I: Obtaining the cached apt archive contents

I: Installing the build-deps

I: user script /var/cache/pbuilder/build//12261/tmp/hooks/D10tmp starting

I: user script /var/cache/pbuilder/build//12261/tmp/hooks/D10tmp finished

I: user script /var/cache/pbuilder/build//12261/tmp/hooks/D50debconf starting

I: user script /var/cache/pbuilder/build//12261/tmp/hooks/D50debconf finished

I: user script /var/cache/pbuilder/build//12261/tmp/hooks/D99apt starting

+ apt-get update

I: user script /var/cache/pbuilder/build//12261/tmp/hooks/D99apt finished

-&gt; Attempting to satisfy build-dependencies

-&gt; Creating pbuilder-satisfydepends-dummy package

Package: pbuilder-satisfydepends-dummy

Version: 0.invalid.0

Architecture: amd64

Maintainer: Debian Pbuilder Team &lt;pbuilder-maint@lists.alioth.debian.org&gt;

Description: Dummy package to satisfy dependencies with aptitude - created by pbuilder

This package was created automatically by pbuilder to satisfy the

build-dependencies of the package being currently built.

Depends: debhelper (&gt;= 9), python (&gt;= 2.6.5)

dpkg-deb: building package `pbuilder-satisfydepends-dummy&#39; in `/tmp/satisfydepends-aptitude/pbuilder-satisfydepends-dummy.deb&#39;.

Selecting previously unselected package pbuilder-satisfydepends-dummy.

(Reading database ... 11689 files and directories currently installed.)

Unpacking pbuilder-satisfydepends-dummy (from .../pbuilder-satisfydepends-dummy.deb) ...

dpkg: pbuilder-satisfydepends-dummy: dependency problems, but configuring anyway as you requested:

pbuilder-satisfydepends-dummy depends on debhelper (&gt;= 9); however:

Package debhelper is not installed.

pbuilder-satisfydepends-dummy depends on python (&gt;= 2.6.5); however:

Package python is not installed.

Setting up pbuilder-satisfydepends-dummy (0.invalid.0) ...

Reading package lists...

Building dependency tree...

Reading state information...

Initializing package states...

Writing extended state information...

The following NEW packages will be installed:

bsdmainutils{a} debhelper{a} file{a} gettext{a} gettext-base{a}

groff-base{a} html2text{a} intltool-debian{a} libasprintf0c2{a}

libcroco3{a} libexpat1{a} libffi5{a} libgettextpo0{a} libglib2.0-0{a}

libmagic1{a} libpcre3{a} libpipeline1{a} libunistring0{a} libxml2{a}

man-db{a} mime-support{a} po-debconf{a} python{a} python-minimal{a}

python2.7{a} python2.7-minimal{a}

0 packages upgraded, 26 newly installed, 0 to remove and 0 not upgraded.

Need to get 0 B/14.6 MB of archives. After unpacking 41.5 MB will be used.

Writing extended state information...

Preconfiguring packages ...

Selecting previously unselected package libpipeline1:amd64.

(Reading database ... 11689 files and directories currently installed.)

Unpacking libpipeline1:amd64 (from .../libpipeline1_1.2.1-1_amd64.deb) ...

Selecting previously unselected package libasprintf0c2:amd64.

Unpacking libasprintf0c2:amd64 (from .../libasprintf0c2_0.18.1.1-9_amd64.deb) ...

Selecting previously unselected package libmagic1:amd64.

Unpacking libmagic1:amd64 (from .../libmagic1_5.11-2+deb7u8_amd64.deb) ...

Selecting previously unselected package libpcre3:amd64.

Unpacking libpcre3:amd64 (from .../libpcre3_1%3a8.30-5_amd64.deb) ...

Selecting previously unselected package libxml2:amd64.

Unpacking libxml2:amd64 (from .../libxml2_2.8.0+dfsg1-7+wheezy4_amd64.deb) ...

Selecting previously unselected package libffi5:amd64.

Unpacking libffi5:amd64 (from .../libffi5_3.0.10-3_amd64.deb) ...

Selecting previously unselected package libglib2.0-0:amd64.

Unpacking libglib2.0-0:amd64 (from .../libglib2.0-0_2.33.12+really2.32.4-5_amd64.deb) ...

Selecting previously unselected package libcroco3:amd64.

Unpacking libcroco3:amd64 (from .../libcroco3_0.6.6-2_amd64.deb) ...

Selecting previously unselected package libexpat1:amd64.

Unpacking libexpat1:amd64 (from .../libexpat1_2.1.0-1+deb7u2_amd64.deb) ...

Selecting previously unselected package libunistring0:amd64.

Unpacking libunistring0:amd64 (from .../libunistring0_0.9.3-5_amd64.deb) ...

Selecting previously unselected package libgettextpo0:amd64.

Unpacking libgettextpo0:amd64 (from .../libgettextpo0_0.18.1.1-9_amd64.deb) ...

Selecting previously unselected package bsdmainutils.

Unpacking bsdmainutils (from .../bsdmainutils_9.0.3_amd64.deb) ...

Selecting previously unselected package groff-base.

Unpacking groff-base (from .../groff-base_1.21-9_amd64.deb) ...

Selecting previously unselected package man-db.

Unpacking man-db (from .../man-db_2.6.2-1_amd64.deb) ...

Selecting previously unselected package file.

Unpacking file (from .../file_5.11-2+deb7u8_amd64.deb) ...

Selecting previously unselected package gettext-base.

Unpacking gettext-base (from .../gettext-base_0.18.1.1-9_amd64.deb) ...

Selecting previously unselected package mime-support.

Unpacking mime-support (from .../mime-support_3.52-1+deb7u1_all.deb) ...

Selecting previously unselected package python2.7-minimal.

Unpacking python2.7-minimal (from .../python2.7-minimal_2.7.3-6+deb7u2_amd64.deb) ...

Selecting previously unselected package python2.7.

Unpacking python2.7 (from .../python2.7_2.7.3-6+deb7u2_amd64.deb) ...

Selecting previously unselected package python-minimal.

Unpacking python-minimal (from .../python-minimal_2.7.3-4+deb7u1_all.deb) ...

Selecting previously unselected package python.

Unpacking python (from .../python_2.7.3-4+deb7u1_all.deb) ...

Selecting previously unselected package html2text.

Unpacking html2text (from .../html2text_1.3.2a-15_amd64.deb) ...

Selecting previously unselected package gettext.

Unpacking gettext (from .../gettext_0.18.1.1-9_amd64.deb) ...

Selecting previously unselected package intltool-debian.

Unpacking intltool-debian (from .../intltool-debian_0.35.0+20060710.1_all.deb) ...

Selecting previously unselected package po-debconf.

Unpacking po-debconf (from .../po-debconf_1.0.16+nmu2_all.deb) ...

Selecting previously unselected package debhelper.

Unpacking debhelper (from .../debhelper_9.20120909_all.deb) ...

Setting up libpipeline1:amd64 (1.2.1-1) ...

Setting up libasprintf0c2:amd64 (0.18.1.1-9) ...

Setting up libmagic1:amd64 (5.11-2+deb7u8) ...

Setting up libpcre3:amd64 (1:8.30-5) ...

Setting up libxml2:amd64 (2.8.0+dfsg1-7+wheezy4) ...

Setting up libffi5:amd64 (3.0.10-3) ...

Setting up libglib2.0-0:amd64 (2.33.12+really2.32.4-5) ...

No schema files found: doing nothing.

Setting up libcroco3:amd64 (0.6.6-2) ...

Setting up libexpat1:amd64 (2.1.0-1+deb7u2) ...

Setting up libunistring0:amd64 (0.9.3-5) ...

Setting up libgettextpo0:amd64 (0.18.1.1-9) ...

Setting up bsdmainutils (9.0.3) ...

update-alternatives: using /usr/bin/bsd-write to provide /usr/bin/write (write) in auto mode

update-alternatives: using /usr/bin/bsd-from to provide /usr/bin/from (from) in auto mode

Setting up groff-base (1.21-9) ...

Setting up man-db (2.6.2-1) ...

Building database of manual pages ...

Setting up file (5.11-2+deb7u8) ...

Setting up gettext-base (0.18.1.1-9) ...

Setting up mime-support (3.52-1+deb7u1) ...

update-alternatives: using /usr/bin/see to provide /usr/bin/view (view) in auto mode

Setting up python2.7-minimal (2.7.3-6+deb7u2) ...

Setting up python2.7 (2.7.3-6+deb7u2) ...

Setting up python-minimal (2.7.3-4+deb7u1) ...

Setting up python (2.7.3-4+deb7u1) ...

Setting up html2text (1.3.2a-15) ...

Setting up gettext (0.18.1.1-9) ...

Setting up intltool-debian (0.35.0+20060710.1) ...

Setting up po-debconf (1.0.16+nmu2) ...

Setting up debhelper (9.20120909) ...

Reading package lists...

Building dependency tree...

Reading state information...

Reading extended state information...

Initializing package states...

Writing extended state information...

-&gt; Finished parsing the build-deps

Reading package lists...

Building dependency tree...

Reading state information...

apt-utils is already the newest version.

The following NEW packages will be installed:

fakeroot

0 upgraded, 1 newly installed, 0 to remove and 0 not upgraded.

Need to get 0 B/109 kB of archives.

After this operation, 325 kB of additional disk space will be used.

Selecting previously unselected package fakeroot.

(Reading database ... 13912 files and directories currently installed.)

Unpacking fakeroot (from .../fakeroot_1.18.4-2_amd64.deb) ...

Processing triggers for man-db ...

Setting up fakeroot (1.18.4-2) ...

update-alternatives: using /usr/bin/fakeroot-sysv to provide /usr/bin/fakeroot (fakeroot) in auto mode

I: Copying back the cached apt archive contents

I: Copying source file

I: copying [/tmp/tmp4lrmqy/debinstall_2.8.0-1~rev357.dsc]

I: copying [/tmp/tmp4lrmqy/debinstall_2.8.0.orig.tar.gz]

I: copying [/tmp/tmp4lrmqy/debinstall_2.8.0-1~rev357.diff.gz]

I: Extracting source

dpkg-source: warning: extracting unsigned source package (debinstall_2.8.0-1~rev357.dsc)

dpkg-source: info: extracting debinstall in debinstall-2.8.0

dpkg-source: info: unpacking debinstall_2.8.0.orig.tar.gz

dpkg-source: info: applying debinstall_2.8.0-1~rev357.diff.gz

I: Building the package

W: no hooks of type A found -- ignoring

I: Running cd tmp/buildd/*/ &amp;&amp; env PATH=&quot;/usr/sbin:/usr/bin:/sbin:/bin&quot; dpkg-buildpackage -us -uc -rfakeroot

dpkg-buildpackage: source package debinstall

dpkg-buildpackage: source version 2.8.0-1~rev357

dpkg-buildpackage: source changed by Julien Cristau &lt;julien.cristau@logilab.fr&gt;

dpkg-source --before-build debinstall-2.8.0

dpkg-buildpackage: host architecture amd64

fakeroot debian/rules clean

dh clean --with python2

dh_testdir

dh_auto_clean

running clean

&#39;build/lib.linux-x86_64-2.7&#39; does not exist -- can&#39;t clean it

&#39;build/bdist.linux-x86_64&#39; does not exist -- can&#39;t clean it

&#39;build/scripts-2.7&#39; does not exist -- can&#39;t clean it

dh_clean

dpkg-source -b debinstall-2.8.0

dpkg-source: warning: no source format specified in debian/source/format, see dpkg-source(1)

dpkg-source: info: using source format `1.0&#39;

dpkg-source: info: building debinstall using existing debinstall_2.8.0.orig.tar.gz

dpkg-source: info: building debinstall in debinstall_2.8.0-1~rev357.diff.gz

dpkg-source: info: building debinstall in debinstall_2.8.0-1~rev357.dsc

debian/rules build

dh build --with python2

dh_testdir

dh_auto_configure

dh_auto_build

running build

running build_py

creating build

creating build/lib.linux-x86_64-2.7

creating build/lib.linux-x86_64-2.7/debinstall

copying ./ldi.py -&gt; build/lib.linux-x86_64-2.7/debinstall

copying ./__pkginfo__.py -&gt; build/lib.linux-x86_64-2.7/debinstall

copying ./__init__.py -&gt; build/lib.linux-x86_64-2.7/debinstall

copying ./debrepo.py -&gt; build/lib.linux-x86_64-2.7/debinstall

copying ./debfiles.py -&gt; build/lib.linux-x86_64-2.7/debinstall

copying ./checkers.py -&gt; build/lib.linux-x86_64-2.7/debinstall

package init file &#39;./tests/__init__.py&#39; not found (or not a regular file)

creating build/lib.linux-x86_64-2.7/debinstall/tests

copying ./tests/test_debfiles.py -&gt; build/lib.linux-x86_64-2.7/debinstall/tests

copying ./tests/test_acceptance.py -&gt; build/lib.linux-x86_64-2.7/debinstall/tests

package init file &#39;./tests/__init__.py&#39; not found (or not a regular file)

running build_scripts

creating build/scripts-2.7

copying and adjusting bin/ldi -&gt; build/scripts-2.7

changing mode of build/scripts-2.7/ldi from 644 to 755

dh_auto_test

fakeroot debian/rules binary

dh binary --with python2

dh_testroot

dh_prep

dh_installdirs

dh_auto_install

running install

running build

running build_py

package init file &#39;./tests/__init__.py&#39; not found (or not a regular file)

package init file &#39;./tests/__init__.py&#39; not found (or not a regular file)

running build_scripts

running install_lib

creating /tmp/buildd/debinstall-2.8.0/debian/debinstall/usr

creating /tmp/buildd/debinstall-2.8.0/debian/debinstall/usr/lib

creating /tmp/buildd/debinstall-2.8.0/debian/debinstall/usr/lib/python2.7

creating /tmp/buildd/debinstall-2.8.0/debian/debinstall/usr/lib/python2.7/dist-packages

creating /tmp/buildd/debinstall-2.8.0/debian/debinstall/usr/lib/python2.7/dist-packages/debinstall

copying build/lib.linux-x86_64-2.7/debinstall/ldi.py -&gt; /tmp/buildd/debinstall-2.8.0/debian/debinstall/usr/lib/python2.7/dist-packages/debinstall

copying build/lib.linux-x86_64-2.7/debinstall/__pkginfo__.py -&gt; /tmp/buildd/debinstall-2.8.0/debian/debinstall/usr/lib/python2.7/dist-packages/debinstall

copying build/lib.linux-x86_64-2.7/debinstall/__init__.py -&gt; /tmp/buildd/debinstall-2.8.0/debian/debinstall/usr/lib/python2.7/dist-packages/debinstall

creating /tmp/buildd/debinstall-2.8.0/debian/debinstall/usr/lib/python2.7/dist-packages/debinstall/tests

copying build/lib.linux-x86_64-2.7/debinstall/tests/test_debfiles.py -&gt; /tmp/buildd/debinstall-2.8.0/debian/debinstall/usr/lib/python2.7/dist-packages/debinstall/tests

copying build/lib.linux-x86_64-2.7/debinstall/tests/test_acceptance.py -&gt; /tmp/buildd/debinstall-2.8.0/debian/debinstall/usr/lib/python2.7/dist-packages/debinstall/tests

copying build/lib.linux-x86_64-2.7/debinstall/debrepo.py -&gt; /tmp/buildd/debinstall-2.8.0/debian/debinstall/usr/lib/python2.7/dist-packages/debinstall

copying build/lib.linux-x86_64-2.7/debinstall/debfiles.py -&gt; /tmp/buildd/debinstall-2.8.0/debian/debinstall/usr/lib/python2.7/dist-packages/debinstall

copying build/lib.linux-x86_64-2.7/debinstall/checkers.py -&gt; /tmp/buildd/debinstall-2.8.0/debian/debinstall/usr/lib/python2.7/dist-packages/debinstall

running install_scripts

creating /tmp/buildd/debinstall-2.8.0/debian/debinstall/usr/bin

copying build/scripts-2.7/ldi -&gt; /tmp/buildd/debinstall-2.8.0/debian/debinstall/usr/bin

changing mode of /tmp/buildd/debinstall-2.8.0/debian/debinstall/usr/bin/ldi to 755

running install_egg_info

Writing /tmp/buildd/debinstall-2.8.0/debian/debinstall/usr/lib/python2.7/dist-packages/debinstall-2.8.0.egg-info

tests/packages/signed_no_source -&gt; /tmp/buildd/debinstall-2.8.0/debian/debinstall/usr/lib/python2.7/dist-packages/debinstall/tests/packages/signed_no_source

tests/packages/signed_package -&gt; /tmp/buildd/debinstall-2.8.0/debian/debinstall/usr/lib/python2.7/dist-packages/debinstall/tests/packages/signed_package

tests/packages/unsigned_package -&gt; /tmp/buildd/debinstall-2.8.0/debian/debinstall/usr/lib/python2.7/dist-packages/debinstall/tests/packages/unsigned_package

tests/packages/signed_package_rev2 -&gt; /tmp/buildd/debinstall-2.8.0/debian/debinstall/usr/lib/python2.7/dist-packages/debinstall/tests/packages/signed_package_rev2

tests/packages/signed_no_source/package1_1.0-1_i386.changes -&gt; /tmp/buildd/debinstall-2.8.0/debian/debinstall/usr/lib/python2.7/dist-packages/debinstall/tests/packages/signed_no_source/package1_1.0-1_i386.changes

tests/packages/signed_no_source/package1_1.0-1_all.deb -&gt; /tmp/buildd/debinstall-2.8.0/debian/debinstall/usr/lib/python2.7/dist-packages/debinstall/tests/packages/signed_no_source/package1_1.0-1_all.deb

tests/packages/signed_package/package1_1.0-1.dsc -&gt; /tmp/buildd/debinstall-2.8.0/debian/debinstall/usr/lib/python2.7/dist-packages/debinstall/tests/packages/signed_package/package1_1.0-1.dsc

tests/packages/signed_package/package1_1.0-1.diff.gz -&gt; /tmp/buildd/debinstall-2.8.0/debian/debinstall/usr/lib/python2.7/dist-packages/debinstall/tests/packages/signed_package/package1_1.0-1.diff.gz

tests/packages/signed_package/package1_1.0-1_i386.changes -&gt; /tmp/buildd/debinstall-2.8.0/debian/debinstall/usr/lib/python2.7/dist-packages/debinstall/tests/packages/signed_package/package1_1.0-1_i386.changes

tests/packages/signed_package/package1_1.0-1_all.deb -&gt; /tmp/buildd/debinstall-2.8.0/debian/debinstall/usr/lib/python2.7/dist-packages/debinstall/tests/packages/signed_package/package1_1.0-1_all.deb

tests/packages/signed_package/package1_1.0.orig.tar.gz -&gt; /tmp/buildd/debinstall-2.8.0/debian/debinstall/usr/lib/python2.7/dist-packages/debinstall/tests/packages/signed_package/package1_1.0.orig.tar.gz

tests/packages/unsigned_package/package1_1.0-1.dsc -&gt; /tmp/buildd/debinstall-2.8.0/debian/debinstall/usr/lib/python2.7/dist-packages/debinstall/tests/packages/unsigned_package/package1_1.0-1.dsc

tests/packages/unsigned_package/package1_1.0-1.diff.gz -&gt; /tmp/buildd/debinstall-2.8.0/debian/debinstall/usr/lib/python2.7/dist-packages/debinstall/tests/packages/unsigned_package/package1_1.0-1.diff.gz

tests/packages/unsigned_package/package1_1.0-1_i386.changes -&gt; /tmp/buildd/debinstall-2.8.0/debian/debinstall/usr/lib/python2.7/dist-packages/debinstall/tests/packages/unsigned_package/package1_1.0-1_i386.changes

tests/packages/unsigned_package/package1_1.0-1_all.deb -&gt; /tmp/buildd/debinstall-2.8.0/debian/debinstall/usr/lib/python2.7/dist-packages/debinstall/tests/packages/unsigned_package/package1_1.0-1_all.deb

tests/packages/unsigned_package/package1_1.0.orig.tar.gz -&gt; /tmp/buildd/debinstall-2.8.0/debian/debinstall/usr/lib/python2.7/dist-packages/debinstall/tests/packages/unsigned_package/package1_1.0.orig.tar.gz

tests/packages/signed_package_rev2/package1_1.0-2.diff.gz -&gt; /tmp/buildd/debinstall-2.8.0/debian/debinstall/usr/lib/python2.7/dist-packages/debinstall/tests/packages/signed_package_rev2/package1_1.0-2.diff.gz

tests/packages/signed_package_rev2/package1_1.0-2_i386.changes -&gt; /tmp/buildd/debinstall-2.8.0/debian/debinstall/usr/lib/python2.7/dist-packages/debinstall/tests/packages/signed_package_rev2/package1_1.0-2_i386.changes

tests/packages/signed_package_rev2/package1_1.0-2.dsc -&gt; /tmp/buildd/debinstall-2.8.0/debian/debinstall/usr/lib/python2.7/dist-packages/debinstall/tests/packages/signed_package_rev2/package1_1.0-2.dsc

tests/packages/signed_package_rev2/package1_1.0-2_i386.build -&gt; /tmp/buildd/debinstall-2.8.0/debian/debinstall/usr/lib/python2.7/dist-packages/debinstall/tests/packages/signed_package_rev2/package1_1.0-2_i386.build

tests/packages/signed_package_rev2/package1_1.0-2_all.deb -&gt; /tmp/buildd/debinstall-2.8.0/debian/debinstall/usr/lib/python2.7/dist-packages/debinstall/tests/packages/signed_package_rev2/package1_1.0-2_all.deb

dh_install

cp: cannot stat `debian/tmp/usr/lib&#39;: No such file or directory

dh_install: cp -a debian/tmp/usr/lib debian/debinstall//usr/ returned exit code 1

make: *** [binary] Error 2

dpkg-buildpackage: error: fakeroot debian/rules binary gave error exit status 2

E: Failed autobuilding of package

I: user script /var/cache/pbuilder/build//12261/tmp/hooks/C10shell starting

If you want to enter into the chroot image to debug, you have to edit your ~/.pbuilderrc with:

export LGP_AUTO_ENTER_SHELL=y

I: user script /var/cache/pbuilder/build//12261/tmp/hooks/C10shell finished

I: unmounting /sys filesystem

I: unmounting /dev filesystem

I: unmounting dev/pts filesystem

I: unmounting run/shm filesystem

I: unmounting proc filesystem

I: cleaning the build env

I: removing directory /var/cache/pbuilder/build//12261 and its subdirectories
<br/>20 printing /tmp/tmpeHUyUb/debinstall/../jessie/debinstall_2.8.0-1~rev357_amd64_jessie.lgp-build.log: I: Using pkgname logfile

I: Current time: Wed Dec 16 17:18:19 CET 2015

I: pbuilder-time-stamp: 1450282699

I: Obtaining the cached apt archive contents

I: Installing the build-deps

I: user script /var/cache/pbuilder/build//10115/tmp/hooks/D10tmp starting

I: user script /var/cache/pbuilder/build//10115/tmp/hooks/D10tmp finished

I: user script /var/cache/pbuilder/build//10115/tmp/hooks/D50debconf starting

I: user script /var/cache/pbuilder/build//10115/tmp/hooks/D50debconf finished

I: user script /var/cache/pbuilder/build//10115/tmp/hooks/D99apt starting

+ apt-get update

I: user script /var/cache/pbuilder/build//10115/tmp/hooks/D99apt finished

-&gt; Attempting to satisfy build-dependencies

-&gt; Creating pbuilder-satisfydepends-dummy package

Package: pbuilder-satisfydepends-dummy

Version: 0.invalid.0

Architecture: amd64

Maintainer: Debian Pbuilder Team &lt;pbuilder-maint@lists.alioth.debian.org&gt;

Description: Dummy package to satisfy dependencies with aptitude - created by pbuilder

This package was created automatically by pbuilder to satisfy the

build-dependencies of the package being currently built.

Depends: debhelper (&gt;= 9), python (&gt;= 2.6.5)

dpkg-deb: building package `pbuilder-satisfydepends-dummy&#39; in `/tmp/satisfydepends-aptitude/pbuilder-satisfydepends-dummy.deb&#39;.

Selecting previously unselected package pbuilder-satisfydepends-dummy.

(Reading database ... 12564 files and directories currently installed.)

Preparing to unpack .../pbuilder-satisfydepends-dummy.deb ...

Unpacking pbuilder-satisfydepends-dummy (0.invalid.0) ...

dpkg: pbuilder-satisfydepends-dummy: dependency problems, but configuring anyway as you requested:

pbuilder-satisfydepends-dummy depends on debhelper (&gt;= 9); however:

Package debhelper is not installed.

pbuilder-satisfydepends-dummy depends on python (&gt;= 2.6.5); however:

Package python is not installed.

Setting up pbuilder-satisfydepends-dummy (0.invalid.0) ...

Reading package lists...

Building dependency tree...

Reading state information...

Initializing package states...

Writing extended state information...

Building tag database...

The following NEW packages will be installed:

bsdmainutils{a} debhelper{a} file{a} gettext{a} gettext-base{a}

groff-base{a} intltool-debian{a} libasprintf0c2{a} libcroco3{a}

libexpat1{a} libglib2.0-0{a} libmagic1{a} libpipeline1{a}

libpython-stdlib{a} libpython2.7-minimal{a} libpython2.7-stdlib{a}

libunistring0{a} libxml2{a} man-db{a} mime-support{a} po-debconf{a}

python{a} python-minimal{a} python2.7{a} python2.7-minimal{a}

0 packages upgraded, 25 newly installed, 0 to remove and 0 not upgraded.

Need to get 0 B/13.0 MB of archives. After unpacking 43.9 MB will be used.

Writing extended state information...

Preconfiguring packages ...

E: Can not write log (Is /dev/pts mounted?) - posix_openpt (2: No such file or directory)

Selecting previously unselected package libpipeline1:amd64.

(Reading database ... 12564 files and directories currently installed.)

Preparing to unpack .../libpipeline1_1.4.0-1_amd64.deb ...

Unpacking libpipeline1:amd64 (1.4.0-1) ...

Selecting previously unselected package groff-base.

Preparing to unpack .../groff-base_1.22.2-8_amd64.deb ...

Unpacking groff-base (1.22.2-8) ...

Selecting previously unselected package bsdmainutils.

Preparing to unpack .../bsdmainutils_9.0.6_amd64.deb ...

Unpacking bsdmainutils (9.0.6) ...

Selecting previously unselected package man-db.

Preparing to unpack .../man-db_2.7.0.2-5_amd64.deb ...

Unpacking man-db (2.7.0.2-5) ...

Selecting previously unselected package libasprintf0c2:amd64.

Preparing to unpack .../libasprintf0c2_0.19.3-2_amd64.deb ...

Unpacking libasprintf0c2:amd64 (0.19.3-2) ...

Selecting previously unselected package libmagic1:amd64.

Preparing to unpack .../libmagic1_1%3a5.22+15-2_amd64.deb ...

Unpacking libmagic1:amd64 (1:5.22+15-2) ...

Selecting previously unselected package libxml2:amd64.

Preparing to unpack .../libxml2_2.9.1+dfsg1-5_amd64.deb ...

Unpacking libxml2:amd64 (2.9.1+dfsg1-5) ...

Selecting previously unselected package libpython2.7-minimal:amd64.

Preparing to unpack .../libpython2.7-minimal_2.7.9-2_amd64.deb ...

Unpacking libpython2.7-minimal:amd64 (2.7.9-2) ...

Selecting previously unselected package python2.7-minimal.

Preparing to unpack .../python2.7-minimal_2.7.9-2_amd64.deb ...

Unpacking python2.7-minimal (2.7.9-2) ...

Selecting previously unselected package python-minimal.

Preparing to unpack .../python-minimal_2.7.9-1_amd64.deb ...

Unpacking python-minimal (2.7.9-1) ...

Selecting previously unselected package mime-support.

Preparing to unpack .../mime-support_3.58_all.deb ...

Unpacking mime-support (3.58) ...

Selecting previously unselected package libexpat1:amd64.

Preparing to unpack .../libexpat1_2.1.0-6+deb8u1_amd64.deb ...

Unpacking libexpat1:amd64 (2.1.0-6+deb8u1) ...

Selecting previously unselected package libpython2.7-stdlib:amd64.

Preparing to unpack .../libpython2.7-stdlib_2.7.9-2_amd64.deb ...

Unpacking libpython2.7-stdlib:amd64 (2.7.9-2) ...

Selecting previously unselected package python2.7.

Preparing to unpack .../python2.7_2.7.9-2_amd64.deb ...

Unpacking python2.7 (2.7.9-2) ...

Selecting previously unselected package libpython-stdlib:amd64.

Preparing to unpack .../libpython-stdlib_2.7.9-1_amd64.deb ...

Unpacking libpython-stdlib:amd64 (2.7.9-1) ...

Setting up libpython2.7-minimal:amd64 (2.7.9-2) ...

Setting up python2.7-minimal (2.7.9-2) ...

Setting up python-minimal (2.7.9-1) ...

Selecting previously unselected package python.

(Reading database ... 13929 files and directories currently installed.)

Preparing to unpack .../python_2.7.9-1_amd64.deb ...

Unpacking python (2.7.9-1) ...

Selecting previously unselected package libglib2.0-0:amd64.

Preparing to unpack .../libglib2.0-0_2.42.1-1_amd64.deb ...

Unpacking libglib2.0-0:amd64 (2.42.1-1) ...

Selecting previously unselected package libcroco3:amd64.

Preparing to unpack .../libcroco3_0.6.8-3+b1_amd64.deb ...

Unpacking libcroco3:amd64 (0.6.8-3+b1) ...

Selecting previously unselected package libunistring0:amd64.

Preparing to unpack .../libunistring0_0.9.3-5.2+b1_amd64.deb ...

Unpacking libunistring0:amd64 (0.9.3-5.2+b1) ...

Selecting previously unselected package file.

Preparing to unpack .../file_1%3a5.22+15-2_amd64.deb ...

Unpacking file (1:5.22+15-2) ...

Selecting previously unselected package gettext-base.

Preparing to unpack .../gettext-base_0.19.3-2_amd64.deb ...

Unpacking gettext-base (0.19.3-2) ...

Selecting previously unselected package gettext.

Preparing to unpack .../gettext_0.19.3-2_amd64.deb ...

Unpacking gettext (0.19.3-2) ...

Selecting previously unselected package intltool-debian.

Preparing to unpack .../intltool-debian_0.35.0+20060710.1_all.deb ...

Unpacking intltool-debian (0.35.0+20060710.1) ...

Selecting previously unselected package po-debconf.

Preparing to unpack .../po-debconf_1.0.16+nmu3_all.deb ...

Unpacking po-debconf (1.0.16+nmu3) ...

Selecting previously unselected package debhelper.

Preparing to unpack .../debhelper_9.20150101_all.deb ...

Unpacking debhelper (9.20150101) ...

Setting up libpipeline1:amd64 (1.4.0-1) ...

Setting up groff-base (1.22.2-8) ...

Setting up bsdmainutils (9.0.6) ...

update-alternatives: using /usr/bin/bsd-write to provide /usr/bin/write (write) in auto mode

update-alternatives: using /usr/bin/bsd-from to provide /usr/bin/from (from) in auto mode

Setting up man-db (2.7.0.2-5) ...

Not building database; man-db/auto-update is not &#39;true&#39;.

Setting up libasprintf0c2:amd64 (0.19.3-2) ...

Setting up libmagic1:amd64 (1:5.22+15-2) ...

Setting up libxml2:amd64 (2.9.1+dfsg1-5) ...

Setting up mime-support (3.58) ...

Setting up libexpat1:amd64 (2.1.0-6+deb8u1) ...

Setting up libpython2.7-stdlib:amd64 (2.7.9-2) ...

Setting up python2.7 (2.7.9-2) ...

Setting up libpython-stdlib:amd64 (2.7.9-1) ...

Setting up python (2.7.9-1) ...

Setting up libglib2.0-0:amd64 (2.42.1-1) ...

No schema files found: doing nothing.

Setting up libcroco3:amd64 (0.6.8-3+b1) ...

Setting up libunistring0:amd64 (0.9.3-5.2+b1) ...

Setting up file (1:5.22+15-2) ...

Setting up gettext-base (0.19.3-2) ...

Setting up gettext (0.19.3-2) ...

Setting up intltool-debian (0.35.0+20060710.1) ...

Setting up po-debconf (1.0.16+nmu3) ...

Setting up debhelper (9.20150101) ...

Processing triggers for libc-bin (2.19-18+deb8u1) ...

Reading package lists...

Building dependency tree...

Reading state information...

Reading extended state information...

Initializing package states...

Writing extended state information...

Building tag database...

-&gt; Finished parsing the build-deps

Reading package lists...

Building dependency tree...

Reading state information...

apt-utils is already the newest version.

The following NEW packages will be installed:

fakeroot libfakeroot

0 upgraded, 2 newly installed, 0 to remove and 0 not upgraded.

Need to get 0 B/129 kB of archives.

After this operation, 434 kB of additional disk space will be used.

E: Can not write log (Is /dev/pts mounted?) - posix_openpt (2: No such file or directory)

Selecting previously unselected package libfakeroot:amd64.

(Reading database ... 14840 files and directories currently installed.)

Preparing to unpack .../libfakeroot_1.20.2-1_amd64.deb ...

Unpacking libfakeroot:amd64 (1.20.2-1) ...

Selecting previously unselected package fakeroot.

Preparing to unpack .../fakeroot_1.20.2-1_amd64.deb ...

Unpacking fakeroot (1.20.2-1) ...

Processing triggers for man-db (2.7.0.2-5) ...

Not building database; man-db/auto-update is not &#39;true&#39;.

Setting up libfakeroot:amd64 (1.20.2-1) ...

Setting up fakeroot (1.20.2-1) ...

update-alternatives: using /usr/bin/fakeroot-sysv to provide /usr/bin/fakeroot (fakeroot) in auto mode

I: Copying back the cached apt archive contents

I: Copying source file

I: copying [/tmp/tmpPJnLv0/debinstall_2.8.0-1~rev357.dsc]

I: copying [/tmp/tmpPJnLv0/debinstall_2.8.0.orig.tar.gz]

I: copying [/tmp/tmpPJnLv0/debinstall_2.8.0-1~rev357.diff.gz]

I: Extracting source

dpkg-source: warning: extracting unsigned source package (debinstall_2.8.0-1~rev357.dsc)

dpkg-source: info: extracting debinstall in debinstall-2.8.0

dpkg-source: info: unpacking debinstall_2.8.0.orig.tar.gz

dpkg-source: info: applying debinstall_2.8.0-1~rev357.diff.gz

I: Building the package

W: no hooks of type A found -- ignoring

I: Running cd tmp/buildd/*/ &amp;&amp; env PATH=&quot;/usr/sbin:/usr/bin:/sbin:/bin&quot; dpkg-buildpackage -us -uc -rfakeroot

dpkg-buildpackage: source package debinstall

dpkg-buildpackage: source version 2.8.0-1~rev357

dpkg-buildpackage: source distribution jessie

dpkg-buildpackage: source changed by Julien Cristau &lt;julien.cristau@logilab.fr&gt;

dpkg-source --before-build debinstall-2.8.0

dpkg-buildpackage: host architecture amd64

fakeroot debian/rules clean

dh clean --with python2

dh_testdir

dh_auto_clean

running clean

&#39;build/lib.linux-x86_64-2.7&#39; does not exist -- can&#39;t clean it

&#39;build/bdist.linux-x86_64&#39; does not exist -- can&#39;t clean it

&#39;build/scripts-2.7&#39; does not exist -- can&#39;t clean it

dh_clean

dpkg-source -b debinstall-2.8.0

dpkg-source: warning: no source format specified in debian/source/format, see dpkg-source(1)

dpkg-source: info: using source format `1.0&#39;

dpkg-source: info: building debinstall using existing debinstall_2.8.0.orig.tar.gz

dpkg-source: info: building debinstall in debinstall_2.8.0-1~rev357.diff.gz

dpkg-source: info: building debinstall in debinstall_2.8.0-1~rev357.dsc

debian/rules build

dh build --with python2

dh_testdir

dh_auto_configure

dh_auto_build

running build

running build_py

creating build

creating build/lib.linux-x86_64-2.7

creating build/lib.linux-x86_64-2.7/debinstall

copying ./ldi.py -&gt; build/lib.linux-x86_64-2.7/debinstall

copying ./__pkginfo__.py -&gt; build/lib.linux-x86_64-2.7/debinstall

copying ./__init__.py -&gt; build/lib.linux-x86_64-2.7/debinstall

copying ./debrepo.py -&gt; build/lib.linux-x86_64-2.7/debinstall

copying ./debfiles.py -&gt; build/lib.linux-x86_64-2.7/debinstall

copying ./checkers.py -&gt; build/lib.linux-x86_64-2.7/debinstall

package init file &#39;./tests/__init__.py&#39; not found (or not a regular file)

creating build/lib.linux-x86_64-2.7/debinstall/tests

copying ./tests/test_debfiles.py -&gt; build/lib.linux-x86_64-2.7/debinstall/tests

copying ./tests/test_acceptance.py -&gt; build/lib.linux-x86_64-2.7/debinstall/tests

package init file &#39;./tests/__init__.py&#39; not found (or not a regular file)

running build_scripts

creating build/scripts-2.7

copying and adjusting bin/ldi -&gt; build/scripts-2.7

changing mode of build/scripts-2.7/ldi from 644 to 755

dh_auto_test

fakeroot debian/rules binary

dh binary --with python2

dh_testroot

dh_prep

dh_auto_install

running install

running build

running build_py

package init file &#39;./tests/__init__.py&#39; not found (or not a regular file)

package init file &#39;./tests/__init__.py&#39; not found (or not a regular file)

running build_scripts

running install_lib

creating /tmp/buildd/debinstall-2.8.0/debian/debinstall/usr

creating /tmp/buildd/debinstall-2.8.0/debian/debinstall/usr/lib

creating /tmp/buildd/debinstall-2.8.0/debian/debinstall/usr/lib/python2.7

creating /tmp/buildd/debinstall-2.8.0/debian/debinstall/usr/lib/python2.7/dist-packages

creating /tmp/buildd/debinstall-2.8.0/debian/debinstall/usr/lib/python2.7/dist-packages/debinstall

copying build/lib.linux-x86_64-2.7/debinstall/ldi.py -&gt; /tmp/buildd/debinstall-2.8.0/debian/debinstall/usr/lib/python2.7/dist-packages/debinstall

copying build/lib.linux-x86_64-2.7/debinstall/__pkginfo__.py -&gt; /tmp/buildd/debinstall-2.8.0/debian/debinstall/usr/lib/python2.7/dist-packages/debinstall

copying build/lib.linux-x86_64-2.7/debinstall/__init__.py -&gt; /tmp/buildd/debinstall-2.8.0/debian/debinstall/usr/lib/python2.7/dist-packages/debinstall

creating /tmp/buildd/debinstall-2.8.0/debian/debinstall/usr/lib/python2.7/dist-packages/debinstall/tests

copying build/lib.linux-x86_64-2.7/debinstall/tests/test_debfiles.py -&gt; /tmp/buildd/debinstall-2.8.0/debian/debinstall/usr/lib/python2.7/dist-packages/debinstall/tests

copying build/lib.linux-x86_64-2.7/debinstall/tests/test_acceptance.py -&gt; /tmp/buildd/debinstall-2.8.0/debian/debinstall/usr/lib/python2.7/dist-packages/debinstall/tests

copying build/lib.linux-x86_64-2.7/debinstall/debrepo.py -&gt; /tmp/buildd/debinstall-2.8.0/debian/debinstall/usr/lib/python2.7/dist-packages/debinstall

copying build/lib.linux-x86_64-2.7/debinstall/debfiles.py -&gt; /tmp/buildd/debinstall-2.8.0/debian/debinstall/usr/lib/python2.7/dist-packages/debinstall

copying build/lib.linux-x86_64-2.7/debinstall/checkers.py -&gt; /tmp/buildd/debinstall-2.8.0/debian/debinstall/usr/lib/python2.7/dist-packages/debinstall

running install_scripts

creating /tmp/buildd/debinstall-2.8.0/debian/debinstall/usr/bin

copying build/scripts-2.7/ldi -&gt; /tmp/buildd/debinstall-2.8.0/debian/debinstall/usr/bin

changing mode of /tmp/buildd/debinstall-2.8.0/debian/debinstall/usr/bin/ldi to 755

running install_egg_info

Writing /tmp/buildd/debinstall-2.8.0/debian/debinstall/usr/lib/python2.7/dist-packages/debinstall-2.8.0.egg-info

tests/packages/signed_no_source -&gt; /tmp/buildd/debinstall-2.8.0/debian/debinstall/usr/lib/python2.7/dist-packages/debinstall/tests/packages/signed_no_source

tests/packages/signed_package -&gt; /tmp/buildd/debinstall-2.8.0/debian/debinstall/usr/lib/python2.7/dist-packages/debinstall/tests/packages/signed_package

tests/packages/unsigned_package -&gt; /tmp/buildd/debinstall-2.8.0/debian/debinstall/usr/lib/python2.7/dist-packages/debinstall/tests/packages/unsigned_package

tests/packages/signed_package_rev2 -&gt; /tmp/buildd/debinstall-2.8.0/debian/debinstall/usr/lib/python2.7/dist-packages/debinstall/tests/packages/signed_package_rev2

tests/packages/signed_no_source/package1_1.0-1_i386.changes -&gt; /tmp/buildd/debinstall-2.8.0/debian/debinstall/usr/lib/python2.7/dist-packages/debinstall/tests/packages/signed_no_source/package1_1.0-1_i386.changes

tests/packages/signed_no_source/package1_1.0-1_all.deb -&gt; /tmp/buildd/debinstall-2.8.0/debian/debinstall/usr/lib/python2.7/dist-packages/debinstall/tests/packages/signed_no_source/package1_1.0-1_all.deb

tests/packages/signed_package/package1_1.0-1.dsc -&gt; /tmp/buildd/debinstall-2.8.0/debian/debinstall/usr/lib/python2.7/dist-packages/debinstall/tests/packages/signed_package/package1_1.0-1.dsc

tests/packages/signed_package/package1_1.0-1.diff.gz -&gt; /tmp/buildd/debinstall-2.8.0/debian/debinstall/usr/lib/python2.7/dist-packages/debinstall/tests/packages/signed_package/package1_1.0-1.diff.gz

tests/packages/signed_package/package1_1.0-1_i386.changes -&gt; /tmp/buildd/debinstall-2.8.0/debian/debinstall/usr/lib/python2.7/dist-packages/debinstall/tests/packages/signed_package/package1_1.0-1_i386.changes

tests/packages/signed_package/package1_1.0-1_all.deb -&gt; /tmp/buildd/debinstall-2.8.0/debian/debinstall/usr/lib/python2.7/dist-packages/debinstall/tests/packages/signed_package/package1_1.0-1_all.deb

tests/packages/signed_package/package1_1.0.orig.tar.gz -&gt; /tmp/buildd/debinstall-2.8.0/debian/debinstall/usr/lib/python2.7/dist-packages/debinstall/tests/packages/signed_package/package1_1.0.orig.tar.gz

tests/packages/unsigned_package/package1_1.0-1.dsc -&gt; /tmp/buildd/debinstall-2.8.0/debian/debinstall/usr/lib/python2.7/dist-packages/debinstall/tests/packages/unsigned_package/package1_1.0-1.dsc

tests/packages/unsigned_package/package1_1.0-1.diff.gz -&gt; /tmp/buildd/debinstall-2.8.0/debian/debinstall/usr/lib/python2.7/dist-packages/debinstall/tests/packages/unsigned_package/package1_1.0-1.diff.gz

tests/packages/unsigned_package/package1_1.0-1_i386.changes -&gt; /tmp/buildd/debinstall-2.8.0/debian/debinstall/usr/lib/python2.7/dist-packages/debinstall/tests/packages/unsigned_package/package1_1.0-1_i386.changes

tests/packages/unsigned_package/package1_1.0-1_all.deb -&gt; /tmp/buildd/debinstall-2.8.0/debian/debinstall/usr/lib/python2.7/dist-packages/debinstall/tests/packages/unsigned_package/package1_1.0-1_all.deb

tests/packages/unsigned_package/package1_1.0.orig.tar.gz -&gt; /tmp/buildd/debinstall-2.8.0/debian/debinstall/usr/lib/python2.7/dist-packages/debinstall/tests/packages/unsigned_package/package1_1.0.orig.tar.gz

tests/packages/signed_package_rev2/package1_1.0-2.diff.gz -&gt; /tmp/buildd/debinstall-2.8.0/debian/debinstall/usr/lib/python2.7/dist-packages/debinstall/tests/packages/signed_package_rev2/package1_1.0-2.diff.gz

tests/packages/signed_package_rev2/package1_1.0-2_i386.changes -&gt; /tmp/buildd/debinstall-2.8.0/debian/debinstall/usr/lib/python2.7/dist-packages/debinstall/tests/packages/signed_package_rev2/package1_1.0-2_i386.changes

tests/packages/signed_package_rev2/package1_1.0-2.dsc -&gt; /tmp/buildd/debinstall-2.8.0/debian/debinstall/usr/lib/python2.7/dist-packages/debinstall/tests/packages/signed_package_rev2/package1_1.0-2.dsc

tests/packages/signed_package_rev2/package1_1.0-2_i386.build -&gt; /tmp/buildd/debinstall-2.8.0/debian/debinstall/usr/lib/python2.7/dist-packages/debinstall/tests/packages/signed_package_rev2/package1_1.0-2_i386.build

tests/packages/signed_package_rev2/package1_1.0-2_all.deb -&gt; /tmp/buildd/debinstall-2.8.0/debian/debinstall/usr/lib/python2.7/dist-packages/debinstall/tests/packages/signed_package_rev2/package1_1.0-2_all.deb

dh_install

cp: cannot stat &#39;debian/tmp/usr/lib&#39;: No such file or directory

dh_install: cp -a debian/tmp/usr/lib debian/debinstall//usr/ returned exit code 1

debian/rules:4: recipe for target &#39;binary&#39; failed

make: *** [binary] Error 2

dpkg-buildpackage: error: fakeroot debian/rules binary gave error exit status 2

E: Failed autobuilding of package

I: user script /var/cache/pbuilder/build//10115/tmp/hooks/C10shell starting

If you want to enter into the chroot image to debug, you have to edit your ~/.pbuilderrc with:

export LGP_AUTO_ENTER_SHELL=y

I: user script /var/cache/pbuilder/build//10115/tmp/hooks/C10shell finished

I: unmounting /sys filesystem

I: unmounting /dev filesystem

I: unmounting dev/pts filesystem

I: unmounting run/shm filesystem

I: unmounting proc filesystem

I: cleaning the build env

I: removing directory /var/cache/pbuilder/build//10115 and its subdirectories
<br/>

log from execution