log_file.txt

download

10 Set NO_SETUPTOOLS=u&#39;1&#39;<br/>10 Set DISPLAY=u&#39;:1.0&#39;<br/>10 Set LC_ALL=u&#39;fr_FR.UTF-8&#39;<br/>10 virtualenv /tmp/tmpC81AX_ `virtualenv /tmp/tmpC81AX_` executed successfuly
output:
New python executable in /tmp/tmpC81AX_/bin/python2
Also creating executable in /tmp/tmpC81AX_/bin/python
Installing setuptools, pip...done.
Running virtualenv with interpreter /usr/bin/python2
<br/>40 python setup.py install `python setup.py install` returned with status : 1
output:
running install
running bdist_egg
running egg_info
creating nazca.egg-info
writing requirements to nazca.egg-info/requires.txt
writing nazca.egg-info/PKG-INFO
writing top-level names to nazca.egg-info/top_level.txt
writing dependency_links to nazca.egg-info/dependency_links.txt
writing manifest file &#39;nazca.egg-info/SOURCES.txt&#39;
package init file &#39;./test/__init__.py&#39; not found (or not a regular file)
reading manifest file &#39;nazca.egg-info/SOURCES.txt&#39;
reading manifest template &#39;MANIFEST.in&#39;
warning: no files found matching &#39;*.py&#39; under directory &#39;.&#39;
writing manifest file &#39;nazca.egg-info/SOURCES.txt&#39;
installing library code to build/bdist.linux-x86_64/egg
running install_lib
running build_py
creating build
creating build/lib.linux-x86_64-2.7
creating build/lib.linux-x86_64-2.7/nazca
copying ./__pkginfo__.py -&gt; build/lib.linux-x86_64-2.7/nazca
copying ./__init__.py -&gt; build/lib.linux-x86_64-2.7/nazca
creating build/lib.linux-x86_64-2.7/nazca/utils
copying ./utils/distances.py -&gt; build/lib.linux-x86_64-2.7/nazca/utils
copying ./utils/dataio.py -&gt; build/lib.linux-x86_64-2.7/nazca/utils
copying ./utils/tokenizer.py -&gt; build/lib.linux-x86_64-2.7/nazca/utils
copying ./utils/__init__.py -&gt; build/lib.linux-x86_64-2.7/nazca/utils
copying ./utils/normalize.py -&gt; build/lib.linux-x86_64-2.7/nazca/utils
copying ./utils/minhashing.py -&gt; build/lib.linux-x86_64-2.7/nazca/utils
creating build/lib.linux-x86_64-2.7/nazca/rl
copying ./rl/blocking.py -&gt; build/lib.linux-x86_64-2.7/nazca/rl
copying ./rl/__init__.py -&gt; build/lib.linux-x86_64-2.7/nazca/rl
copying ./rl/aligner.py -&gt; build/lib.linux-x86_64-2.7/nazca/rl
package init file &#39;./test/__init__.py&#39; not found (or not a regular file)
creating build/lib.linux-x86_64-2.7/nazca/test
copying ./test/test_blocking.py -&gt; build/lib.linux-x86_64-2.7/nazca/test
copying ./test/test_ner.py -&gt; build/lib.linux-x86_64-2.7/nazca/test
copying ./test/test_tokenizer.py -&gt; build/lib.linux-x86_64-2.7/nazca/test
copying ./test/test_filters.py -&gt; build/lib.linux-x86_64-2.7/nazca/test
copying ./test/test_dataio.py -&gt; build/lib.linux-x86_64-2.7/nazca/test
copying ./test/test_alignment.py -&gt; build/lib.linux-x86_64-2.7/nazca/test
copying ./test/test_preprocessors.py -&gt; build/lib.linux-x86_64-2.7/nazca/test
copying ./test/test_minhashing.py -&gt; build/lib.linux-x86_64-2.7/nazca/test
copying ./test/test_normalize.py -&gt; build/lib.linux-x86_64-2.7/nazca/test
copying ./test/test_distances.py -&gt; build/lib.linux-x86_64-2.7/nazca/test
creating build/lib.linux-x86_64-2.7/nazca/ner
copying ./ner/__init__.py -&gt; build/lib.linux-x86_64-2.7/nazca/ner
copying ./ner/preprocessors.py -&gt; build/lib.linux-x86_64-2.7/nazca/ner
copying ./ner/filters.py -&gt; build/lib.linux-x86_64-2.7/nazca/ner
copying ./ner/sources.py -&gt; build/lib.linux-x86_64-2.7/nazca/ner
creating build/lib.linux-x86_64-2.7/nazca/data
copying ./data/us_states.py -&gt; build/lib.linux-x86_64-2.7/nazca/data
copying ./data/stopwords.py -&gt; build/lib.linux-x86_64-2.7/nazca/data
copying ./data/countries.py -&gt; build/lib.linux-x86_64-2.7/nazca/data
copying ./data/__init__.py -&gt; build/lib.linux-x86_64-2.7/nazca/data
creating build/lib.linux-x86_64-2.7/nazca/examples
copying ./examples/demo.py -&gt; build/lib.linux-x86_64-2.7/nazca/examples
copying ./examples/__init__.py -&gt; build/lib.linux-x86_64-2.7/nazca/examples
package init file &#39;./test/__init__.py&#39; not found (or not a regular file)
creating build/bdist.linux-x86_64
creating build/bdist.linux-x86_64/egg
creating build/bdist.linux-x86_64/egg/nazca
creating build/bdist.linux-x86_64/egg/nazca/utils
copying build/lib.linux-x86_64-2.7/nazca/utils/distances.py -&gt; build/bdist.linux-x86_64/egg/nazca/utils
copying build/lib.linux-x86_64-2.7/nazca/utils/dataio.py -&gt; build/bdist.linux-x86_64/egg/nazca/utils
copying build/lib.linux-x86_64-2.7/nazca/utils/tokenizer.py -&gt; build/bdist.linux-x86_64/egg/nazca/utils
copying build/lib.linux-x86_64-2.7/nazca/utils/__init__.py -&gt; build/bdist.linux-x86_64/egg/nazca/utils
copying build/lib.linux-x86_64-2.7/nazca/utils/normalize.py -&gt; build/bdist.linux-x86_64/egg/nazca/utils
copying build/lib.linux-x86_64-2.7/nazca/utils/minhashing.py -&gt; build/bdist.linux-x86_64/egg/nazca/utils
creating build/bdist.linux-x86_64/egg/nazca/rl
copying build/lib.linux-x86_64-2.7/nazca/rl/blocking.py -&gt; build/bdist.linux-x86_64/egg/nazca/rl
copying build/lib.linux-x86_64-2.7/nazca/rl/__init__.py -&gt; build/bdist.linux-x86_64/egg/nazca/rl
copying build/lib.linux-x86_64-2.7/nazca/rl/aligner.py -&gt; build/bdist.linux-x86_64/egg/nazca/rl
copying build/lib.linux-x86_64-2.7/nazca/__pkginfo__.py -&gt; build/bdist.linux-x86_64/egg/nazca
creating build/bdist.linux-x86_64/egg/nazca/test
copying build/lib.linux-x86_64-2.7/nazca/test/test_blocking.py -&gt; build/bdist.linux-x86_64/egg/nazca/test
copying build/lib.linux-x86_64-2.7/nazca/test/test_ner.py -&gt; build/bdist.linux-x86_64/egg/nazca/test
copying build/lib.linux-x86_64-2.7/nazca/test/test_tokenizer.py -&gt; build/bdist.linux-x86_64/egg/nazca/test
copying build/lib.linux-x86_64-2.7/nazca/test/test_filters.py -&gt; build/bdist.linux-x86_64/egg/nazca/test
copying build/lib.linux-x86_64-2.7/nazca/test/test_dataio.py -&gt; build/bdist.linux-x86_64/egg/nazca/test
copying build/lib.linux-x86_64-2.7/nazca/test/test_alignment.py -&gt; build/bdist.linux-x86_64/egg/nazca/test
copying build/lib.linux-x86_64-2.7/nazca/test/test_preprocessors.py -&gt; build/bdist.linux-x86_64/egg/nazca/test
copying build/lib.linux-x86_64-2.7/nazca/test/test_minhashing.py -&gt; build/bdist.linux-x86_64/egg/nazca/test
copying build/lib.linux-x86_64-2.7/nazca/test/test_normalize.py -&gt; build/bdist.linux-x86_64/egg/nazca/test
copying build/lib.linux-x86_64-2.7/nazca/test/test_distances.py -&gt; build/bdist.linux-x86_64/egg/nazca/test
copying build/lib.linux-x86_64-2.7/nazca/__init__.py -&gt; build/bdist.linux-x86_64/egg/nazca
creating build/bdist.linux-x86_64/egg/nazca/ner
copying build/lib.linux-x86_64-2.7/nazca/ner/__init__.py -&gt; build/bdist.linux-x86_64/egg/nazca/ner
copying build/lib.linux-x86_64-2.7/nazca/ner/preprocessors.py -&gt; build/bdist.linux-x86_64/egg/nazca/ner
copying build/lib.linux-x86_64-2.7/nazca/ner/filters.py -&gt; build/bdist.linux-x86_64/egg/nazca/ner
copying build/lib.linux-x86_64-2.7/nazca/ner/sources.py -&gt; build/bdist.linux-x86_64/egg/nazca/ner
creating build/bdist.linux-x86_64/egg/nazca/data
copying build/lib.linux-x86_64-2.7/nazca/data/us_states.py -&gt; build/bdist.linux-x86_64/egg/nazca/data
copying build/lib.linux-x86_64-2.7/nazca/data/stopwords.py -&gt; build/bdist.linux-x86_64/egg/nazca/data
copying build/lib.linux-x86_64-2.7/nazca/data/countries.py -&gt; build/bdist.linux-x86_64/egg/nazca/data
copying build/lib.linux-x86_64-2.7/nazca/data/__init__.py -&gt; build/bdist.linux-x86_64/egg/nazca/data
creating build/bdist.linux-x86_64/egg/nazca/examples
copying build/lib.linux-x86_64-2.7/nazca/examples/demo.py -&gt; build/bdist.linux-x86_64/egg/nazca/examples
copying build/lib.linux-x86_64-2.7/nazca/examples/__init__.py -&gt; build/bdist.linux-x86_64/egg/nazca/examples
byte-compiling build/bdist.linux-x86_64/egg/nazca/utils/distances.py to distances.pyc
byte-compiling build/bdist.linux-x86_64/egg/nazca/utils/dataio.py to dataio.pyc
byte-compiling build/bdist.linux-x86_64/egg/nazca/utils/tokenizer.py to tokenizer.pyc
byte-compiling build/bdist.linux-x86_64/egg/nazca/utils/__init__.py to __init__.pyc
byte-compiling build/bdist.linux-x86_64/egg/nazca/utils/normalize.py to normalize.pyc
byte-compiling build/bdist.linux-x86_64/egg/nazca/utils/minhashing.py to minhashing.pyc
byte-compiling build/bdist.linux-x86_64/egg/nazca/rl/blocking.py to blocking.pyc
byte-compiling build/bdist.linux-x86_64/egg/nazca/rl/__init__.py to __init__.pyc
byte-compiling build/bdist.linux-x86_64/egg/nazca/rl/aligner.py to aligner.pyc
byte-compiling build/bdist.linux-x86_64/egg/nazca/__pkginfo__.py to __pkginfo__.pyc
byte-compiling build/bdist.linux-x86_64/egg/nazca/test/test_blocking.py to test_blocking.pyc
byte-compiling build/bdist.linux-x86_64/egg/nazca/test/test_ner.py to test_ner.pyc
byte-compiling build/bdist.linux-x86_64/egg/nazca/test/test_tokenizer.py to test_tokenizer.pyc
byte-compiling build/bdist.linux-x86_64/egg/nazca/test/test_filters.py to test_filters.pyc
byte-compiling build/bdist.linux-x86_64/egg/nazca/test/test_dataio.py to test_dataio.pyc
byte-compiling build/bdist.linux-x86_64/egg/nazca/test/test_alignment.py to test_alignment.pyc
byte-compiling build/bdist.linux-x86_64/egg/nazca/test/test_preprocessors.py to test_preprocessors.pyc
byte-compiling build/bdist.linux-x86_64/egg/nazca/test/test_minhashing.py to test_minhashing.pyc
byte-compiling build/bdist.linux-x86_64/egg/nazca/test/test_normalize.py to test_normalize.pyc
byte-compiling build/bdist.linux-x86_64/egg/nazca/test/test_distances.py to test_distances.pyc
byte-compiling build/bdist.linux-x86_64/egg/nazca/__init__.py to __init__.pyc
byte-compiling build/bdist.linux-x86_64/egg/nazca/ner/__init__.py to __init__.pyc
byte-compiling build/bdist.linux-x86_64/egg/nazca/ner/preprocessors.py to preprocessors.pyc
byte-compiling build/bdist.linux-x86_64/egg/nazca/ner/filters.py to filters.pyc
byte-compiling build/bdist.linux-x86_64/egg/nazca/ner/sources.py to sources.pyc
byte-compiling build/bdist.linux-x86_64/egg/nazca/data/us_states.py to us_states.pyc
byte-compiling build/bdist.linux-x86_64/egg/nazca/data/stopwords.py to stopwords.pyc
byte-compiling build/bdist.linux-x86_64/egg/nazca/data/countries.py to countries.pyc
byte-compiling build/bdist.linux-x86_64/egg/nazca/data/__init__.py to __init__.pyc
byte-compiling build/bdist.linux-x86_64/egg/nazca/examples/demo.py to demo.pyc
byte-compiling build/bdist.linux-x86_64/egg/nazca/examples/__init__.py to __init__.pyc
creating build/bdist.linux-x86_64/egg/EGG-INFO
copying nazca.egg-info/PKG-INFO -&gt; build/bdist.linux-x86_64/egg/EGG-INFO
copying nazca.egg-info/SOURCES.txt -&gt; build/bdist.linux-x86_64/egg/EGG-INFO
copying nazca.egg-info/dependency_links.txt -&gt; build/bdist.linux-x86_64/egg/EGG-INFO
copying nazca.egg-info/requires.txt -&gt; build/bdist.linux-x86_64/egg/EGG-INFO
copying nazca.egg-info/top_level.txt -&gt; build/bdist.linux-x86_64/egg/EGG-INFO
zip_safe flag not set; analyzing archive contents...
nazca.test.test_blocking: module references __file__
nazca.test.test_dataio: module references __file__
nazca.test.test_alignment: module references __file__
nazca.test.test_minhashing: module references __file__
nazca.test.test_normalize: module references __file__
creating dist
creating &#39;dist/nazca-0.7.2-py2.7.egg&#39; and adding &#39;build/bdist.linux-x86_64/egg&#39; to it
removing &#39;build/bdist.linux-x86_64/egg&#39; (and everything under it)
Processing nazca-0.7.2-py2.7.egg
creating /tmp/tmpC81AX_/lib/python2.7/site-packages/nazca-0.7.2-py2.7.egg
Extracting nazca-0.7.2-py2.7.egg to /tmp/tmpC81AX_/lib/python2.7/site-packages
Adding nazca 0.7.2 to easy-install.pth file

Installed /tmp/tmpC81AX_/lib/python2.7/site-packages/nazca-0.7.2-py2.7.egg
Processing dependencies for nazca==0.7.2
Searching for sparqlwrapper
Reading https://pypi.python.org/simple/sparqlwrapper/
Best match: SPARQLWrapper 1.6.4
Downloading https://pypi.python.org/packages/2.7/S/SPARQLWrapper/SPARQLWrapper-1.6.4-py2.7.egg#md5=1ff0d9c168ed302f03901d753a1a76c5
Processing SPARQLWrapper-1.6.4-py2.7.egg
Moving SPARQLWrapper-1.6.4-py2.7.egg to /tmp/tmpC81AX_/lib/python2.7/site-packages
Adding SPARQLWrapper 1.6.4 to easy-install.pth file

Installed /tmp/tmpC81AX_/lib/python2.7/site-packages/SPARQLWrapper-1.6.4-py2.7.egg
Searching for lxml
Reading https://pypi.python.org/simple/lxml/
Best match: lxml 3.4.4
Downloading https://pypi.python.org/packages/source/l/lxml/lxml-3.4.4.tar.gz#md5=a9a65972afc173ec7a39c585f4eea69c
Processing lxml-3.4.4.tar.gz
Writing /tmp/easy_install-xd7HuU/lxml-3.4.4/setup.cfg
Running lxml-3.4.4/setup.py -q bdist_egg --dist-dir /tmp/easy_install-xd7HuU/lxml-3.4.4/egg-dist-tmp-V9_MVo
/usr/lib/python2.7/distutils/dist.py:267: UserWarning: Unknown distribution option: &#39;bugtrack_url&#39;
warnings.warn(msg)
Building lxml version 3.4.4.
Building without Cython.
Using build configuration of libxslt 1.1.28
Adding lxml 3.4.4 to easy-install.pth file

Installed /tmp/tmpC81AX_/lib/python2.7/site-packages/lxml-3.4.4-py2.7-linux-x86_64.egg
Searching for numpy
Reading https://pypi.python.org/simple/numpy/
Best match: numpy 1.9.2
Downloading https://pypi.python.org/packages/source/n/numpy/numpy-1.9.2.zip#md5=e80c19d2fb25af576460bb7dac31c59a
Processing numpy-1.9.2.zip
Writing /tmp/easy_install-VXHNU7/numpy-1.9.2/setup.cfg
Running numpy-1.9.2/setup.py -q bdist_egg --dist-dir /tmp/easy_install-VXHNU7/numpy-1.9.2/egg-dist-tmp-UaKG_G
Running from numpy source directory.
Warning: distutils distribution has been initialized, it may be too late to add a subpackage commandWarning: distutils distribution has been initialized, it may be too late to add a subpackage fcompilerWarning: distutils distribution has been initialized, it may be too late to add a subpackage distutilsWarning: distutils distribution has been initialized, it may be too late to add a subpackage testingWarning: distutils distribution has been initialized, it may be too late to add a subpackage f2pyWarning: distutils distribution has been initialized, it may be too late to add an extension _dummyWarning: distutils distribution has been initialized, it may be too late to add a library npysortWarning: distutils distribution has been initialized, it may be too late to add an extension multiarrayWarning: distutils distribution has been initialized, it may be too late to add an extension umathWarning: distutils distribution has been initialized, it may be too late to add an extension scalarmath/tmp/easy_install-VXHNU7/numpy-1.9.2/numpy/distutils/system_info.py:1603: UserWarning:
Atlas (http://math-atlas.sourceforge.net/) libraries not found.
Directories to search for the libraries can be specified in the
numpy/distutils/site.cfg file (section [atlas]) or by setting
the ATLAS environment variable.
warnings.warn(AtlasNotFoundError.__doc__)
/tmp/easy_install-VXHNU7/numpy-1.9.2/numpy/distutils/system_info.py:1612: UserWarning:
Blas (http://www.netlib.org/blas/) libraries not found.
Directories to search for the libraries can be specified in the
numpy/distutils/site.cfg file (section [blas]) or by setting
the BLAS environment variable.
warnings.warn(BlasNotFoundError.__doc__)
/tmp/easy_install-VXHNU7/numpy-1.9.2/numpy/distutils/system_info.py:1615: UserWarning:
Blas (http://www.netlib.org/blas/) sources not found.
Directories to search for the sources can be specified in the
numpy/distutils/site.cfg file (section [blas_src]) or by setting
the BLAS_SRC environment variable.
warnings.warn(BlasSrcNotFoundError.__doc__)
Warning: distutils distribution has been initialized, it may be too late to add an extension _dotblasWarning: distutils distribution has been initialized, it may be too late to add an extension umath_testsWarning: distutils distribution has been initialized, it may be too late to add an extension test_rationalWarning: distutils distribution has been initialized, it may be too late to add an extension struct_ufunc_testWarning: distutils distribution has been initialized, it may be too late to add an extension multiarray_testsWarning: distutils distribution has been initialized, it may be too late to add an extension operand_flag_testsWarning: distutils distribution has been initialized, it may be too late to add a subpackage coreWarning: distutils distribution has been initialized, it may be too late to add an extension _compiled_baseWarning: distutils distribution has been initialized, it may be too late to add a subpackage libWarning: distutils distribution has been initialized, it may be too late to add an extension fftpack_liteWarning: distutils distribution has been initialized, it may be too late to add a subpackage fft/tmp/easy_install-VXHNU7/numpy-1.9.2/numpy/distutils/system_info.py:1505: UserWarning:
Atlas (http://math-atlas.sourceforge.net/) libraries not found.
Directories to search for the libraries can be specified in the
numpy/distutils/site.cfg file (section [atlas]) or by setting
the ATLAS environment variable.
warnings.warn(AtlasNotFoundError.__doc__)
/tmp/easy_install-VXHNU7/numpy-1.9.2/numpy/distutils/system_info.py:1516: UserWarning:
Lapack (http://www.netlib.org/lapack/) libraries not found.
Directories to search for the libraries can be specified in the
numpy/distutils/site.cfg file (section [lapack]) or by setting
the LAPACK environment variable.
warnings.warn(LapackNotFoundError.__doc__)
/tmp/easy_install-VXHNU7/numpy-1.9.2/numpy/distutils/system_info.py:1519: UserWarning:
Lapack (http://www.netlib.org/lapack/) sources not found.
Directories to search for the sources can be specified in the
numpy/distutils/site.cfg file (section [lapack_src]) or by setting
the LAPACK_SRC environment variable.
warnings.warn(LapackSrcNotFoundError.__doc__)
Warning: distutils distribution has been initialized, it may be too late to add an extension lapack_liteWarning: distutils distribution has been initialized, it may be too late to add an extension _umath_linalgWarning: distutils distribution has been initialized, it may be too late to add a subpackage linalgWarning: distutils distribution has been initialized, it may be too late to add an extension mtrandWarning: distutils distribution has been initialized, it may be too late to add a subpackage randomWarning: distutils distribution has been initialized, it may be too late to add a subpackage maWarning: distutils distribution has been initialized, it may be too late to add a subpackage matrixlibWarning: distutils distribution has been initialized, it may be too late to add a subpackage compatWarning: distutils distribution has been initialized, it may be too late to add a subpackage polynomialWarning: distutils distribution has been initialized, it may be too late to add a subpackage docWarning: distutils distribution has been initialized, it may be too late to add a subpackage numpynon-existing path in &#39;numpy/distutils&#39;: &#39;site.cfg&#39;
non-existing path in &#39;numpy/f2py&#39;: &#39;docs&#39;
non-existing path in &#39;numpy/f2py&#39;: &#39;f2py.1&#39;
non-existing path in &#39;numpy/lib&#39;: &#39;benchmarks&#39;
Could not locate executable gfortran
Could not locate executable f95
Could not locate executable ifort
Could not locate executable ifc
Could not locate executable lf95
Could not locate executable pgfortran
Could not locate executable f90
Could not locate executable f77
Could not locate executable fort
Could not locate executable efort
Could not locate executable efc
Could not locate executable g77
Could not locate executable g95
Could not locate executable pathf95
don&#39;t know how to compile Fortran code on platform &#39;posix&#39;
_configtest.c:1:5: warning: conflicting types for built-in function ‘exp’
int exp (void);
^
_configtest.o: In function `main&#39;:
/tmp/easy_install-VXHNU7/numpy-1.9.2/_configtest.c:6: undefined reference to `exp&#39;
collect2: error: ld returned 1 exit status
_configtest.c:1:5: warning: conflicting types for built-in function ‘exp’
int exp (void);
^
_configtest.c:1:20: fatal error: Python.h: No such file or directory
#include &lt;Python.h&gt;
^
compilation terminated.
_configtest.o: In function `main&#39;:
/tmp/easy_install-VXHNU7/numpy-1.9.2/_configtest.c:6: undefined reference to `exp&#39;
collect2: error: ld returned 1 exit status
_configtest.c:1:20: fatal error: Python.h: No such file or directory
#include &lt;Python.h&gt;
^
compilation terminated.
Traceback (most recent call last):
File &quot;setup.py&quot;, line 168, in &lt;module&gt;
install()
File &quot;setup.py&quot;, line 164, in install
**kwargs
File &quot;/usr/lib/python2.7/distutils/core.py&quot;, line 151, in setup
dist.run_commands()
File &quot;/usr/lib/python2.7/distutils/dist.py&quot;, line 953, in run_commands
self.run_command(cmd)
File &quot;/usr/lib/python2.7/distutils/dist.py&quot;, line 972, in run_command
cmd_obj.run()
File &quot;/tmp/tmpC81AX_/local/lib/python2.7/site-packages/setuptools/command/install.py&quot;, line 67, in run
self.do_egg_install()
File &quot;/tmp/tmpC81AX_/local/lib/python2.7/site-packages/setuptools/command/install.py&quot;, line 117, in do_egg_install
cmd.run()
File &quot;/tmp/tmpC81AX_/local/lib/python2.7/site-packages/setuptools/command/easy_install.py&quot;, line 393, in run
self.easy_install(spec, not self.no_deps)
File &quot;/tmp/tmpC81AX_/local/lib/python2.7/site-packages/setuptools/command/easy_install.py&quot;, line 617, in easy_install
return self.install_item(None, spec, tmpdir, deps, True)
File &quot;/tmp/tmpC81AX_/local/lib/python2.7/site-packages/setuptools/command/easy_install.py&quot;, line 668, in install_item
self.process_distribution(spec, dist, deps)
File &quot;/tmp/tmpC81AX_/local/lib/python2.7/site-packages/setuptools/command/easy_install.py&quot;, line 716, in process_distribution
[requirement], self.local_index, self.easy_install
File &quot;/tmp/tmpC81AX_/local/lib/python2.7/site-packages/pkg_resources.py&quot;, line 631, in resolve
dist = best[req.key] = env.best_match(req, ws, installer)
File &quot;/tmp/tmpC81AX_/local/lib/python2.7/site-packages/pkg_resources.py&quot;, line 874, in best_match
return self.obtain(req, installer)
File &quot;/tmp/tmpC81AX_/local/lib/python2.7/site-packages/pkg_resources.py&quot;, line 886, in obtain
return installer(requirement)
File &quot;/tmp/tmpC81AX_/local/lib/python2.7/site-packages/setuptools/command/easy_install.py&quot;, line 636, in easy_install
return self.install_item(spec, dist.location, tmpdir, deps)
File &quot;/tmp/tmpC81AX_/local/lib/python2.7/site-packages/setuptools/command/easy_install.py&quot;, line 666, in install_item
dists = self.install_eggs(spec, download, tmpdir)
File &quot;/tmp/tmpC81AX_/local/lib/python2.7/site-packages/setuptools/command/easy_install.py&quot;, line 856, in install_eggs
return self.build_and_install(setup_script, setup_base)
File &quot;/tmp/tmpC81AX_/local/lib/python2.7/site-packages/setuptools/command/easy_install.py&quot;, line 1078, in build_and_install
self.run_setup(setup_script, setup_base, args)
File &quot;/tmp/tmpC81AX_/local/lib/python2.7/site-packages/setuptools/command/easy_install.py&quot;, line 1063, in run_setup
run_setup(setup_script, args)
File &quot;/tmp/tmpC81AX_/local/lib/python2.7/site-packages/setuptools/sandbox.py&quot;, line 68, in run_setup
DirectorySandbox(setup_dir).run(runner)
File &quot;/tmp/tmpC81AX_/local/lib/python2.7/site-packages/setuptools/sandbox.py&quot;, line 114, in run
return func()
File &quot;/tmp/tmpC81AX_/local/lib/python2.7/site-packages/setuptools/sandbox.py&quot;, line 67, in runner
_execfile(setup_script, ns)
File &quot;/tmp/tmpC81AX_/local/lib/python2.7/site-packages/setuptools/sandbox.py&quot;, line 43, in _execfile
exec(code, globals, locals)
File &quot;/tmp/easy_install-VXHNU7/numpy-1.9.2/setup.py&quot;, line 251, in &lt;module&gt;

File &quot;/tmp/easy_install-VXHNU7/numpy-1.9.2/setup.py&quot;, line 243, in setup_package

File &quot;/tmp/easy_install-VXHNU7/numpy-1.9.2/numpy/distutils/core.py&quot;, line 169, in setup
File &quot;/usr/lib/python2.7/distutils/core.py&quot;, line 151, in setup
dist.run_commands()
File &quot;/usr/lib/python2.7/distutils/dist.py&quot;, line 953, in run_commands
self.run_command(cmd)
File &quot;/usr/lib/python2.7/distutils/dist.py&quot;, line 972, in run_command
cmd_obj.run()
File &quot;/tmp/tmpC81AX_/local/lib/python2.7/site-packages/setuptools/command/bdist_egg.py&quot;, line 152, in run
self.run_command(&quot;egg_info&quot;)
File &quot;/usr/lib/python2.7/distutils/cmd.py&quot;, line 326, in run_command
self.distribution.run_command(command)
File &quot;/usr/lib/python2.7/distutils/dist.py&quot;, line 972, in run_command
cmd_obj.run()
File &quot;/tmp/easy_install-VXHNU7/numpy-1.9.2/numpy/distutils/command/egg_info.py&quot;, line 10, in run
File &quot;/usr/lib/python2.7/distutils/cmd.py&quot;, line 326, in run_command
self.distribution.run_command(command)
File &quot;/usr/lib/python2.7/distutils/dist.py&quot;, line 972, in run_command
cmd_obj.run()
File &quot;/tmp/easy_install-VXHNU7/numpy-1.9.2/numpy/distutils/command/build_src.py&quot;, line 153, in run
File &quot;/tmp/easy_install-VXHNU7/numpy-1.9.2/numpy/distutils/command/build_src.py&quot;, line 170, in build_sources
File &quot;/tmp/easy_install-VXHNU7/numpy-1.9.2/numpy/distutils/command/build_src.py&quot;, line 329, in build_extension_sources
File &quot;/tmp/easy_install-VXHNU7/numpy-1.9.2/numpy/distutils/command/build_src.py&quot;, line 386, in generate_sources
File &quot;numpy/core/setup.py&quot;, line 432, in generate_config_h

File &quot;numpy/core/setup.py&quot;, line 42, in check_types
from distutils.command.build_py import build_py_2to3 as build_py
File &quot;numpy/core/setup.py&quot;, line 293, in check_types

SystemError: Cannot compile &#39;Python.h&#39;. Perhaps you need to install python-dev|python-devel.
<br/>

log from execution