log_file.txt

download

40 tox `tox` returned with status : 1
output:
GLOB sdist-make: /tmp/tmpU4RbjA/src/10168/setup.py
WARNING:could not copy distfile to /var/lib/narval/.tox/distshare
py27 create: /tmp/tmpU4RbjA/src/10168/.tox/py27
py27 installdeps: pytz, egenix-mx-base
ERROR: invocation failed, logfile: /tmp/tmpU4RbjA/src/10168/.tox/py27/log/py27-1.log
ERROR: actionid=py27
msg=getenv
cmdargs=[local('/tmp/tmpU4RbjA/src/10168/.tox/py27/bin/pip'), 'install', '--pre', 'pytz', 'egenix-mx-base']
env={'HGRCPATH': '/dev/null', '_SYSTEMCTL_SKIP_REDIRECT': 'true', 'PYTHONHASHSEED': '2559869156', 'VIRTUAL_ENV': '/tmp/tmpU4RbjA/src/10168/.tox/py27', 'LANG': 'en_US.UTF-8', 'PATH': '/tmp/tmpU4RbjA/src/10168/.tox/py27/bin:/sbin/:/usr/local/sbin:/usr/local/bin:/usr/sbin:/usr/bin:/sbin:/bin', 'LINES': '24', 'APYCOT_ROOT': '/tmp/tmpU4RbjA', 'HOME': '/var/lib/narval', 'LC_ALL': 'fr_FR.UTF-8', 'PYTHONPATH': '/usr/share/narval:/usr/share/narval', 'DISPLAY': ':1.0', 'PWD': '/', 'LANGUAGE': 'en_US:en', 'COLUMNS': '80'}
Downloading/unpacking pytz
Downloading/unpacking egenix-mx-base
Running setup.py (path:/tmp/pip-build-_c9rXb/egenix-mx-base/setup.py) egg_info for package egenix-mx-base
Installing collected packages: pytz, egenix-mx-base
Running setup.py install for egenix-mx-base
found usable build data file 'build/build-py2.7_ucs4.pck'
prebuilt archive found: skipping the build process and reusing the existing build files and data
setting platform to 'linux-x86_64'
restoring build data from a previous build run
skipping the build process and reusing existing build files
error: package directory 'mx' does not exist
Complete output from command /tmp/tmpU4RbjA/src/10168/.tox/py27/bin/python2.7 -c "import setuptools, tokenize;__file__='/tmp/pip-build-_c9rXb/egenix-mx-base/setup.py';exec(compile(getattr(tokenize, 'open', open)(__file__).read().replace('\r\n', '\n'), __file__, 'exec'))" install --record /tmp/pip-zEI4lD-record/install-record.txt --single-version-externally-managed --compile --install-headers /tmp/tmpU4RbjA/src/10168/.tox/py27/include/site/python2.7:
running install

found usable build data file 'build/build-py2.7_ucs4.pck'

prebuilt archive found: skipping the build process and reusing the existing build files and data

setting platform to 'linux-x86_64'

restoring build data from a previous build run

running build

skipping the build process and reusing existing build files

running install_lib

running build_py

error: package directory 'mx' does not exist

----------------------------------------
Cleaning up...
Command /tmp/tmpU4RbjA/src/10168/.tox/py27/bin/python2.7 -c "import setuptools, tokenize;__file__='/tmp/pip-build-_c9rXb/egenix-mx-base/setup.py';exec(compile(getattr(tokenize, 'open', open)(__file__).read().replace('\r\n', '\n'), __file__, 'exec'))" install --record /tmp/pip-zEI4lD-record/install-record.txt --single-version-externally-managed --compile --install-headers /tmp/tmpU4RbjA/src/10168/.tox/py27/include/site/python2.7 failed with error code 1 in /tmp/pip-build-_c9rXb/egenix-mx-base
Traceback (most recent call last):
File ".tox/py27/bin/pip", line 11, in <module>
sys.exit(main())
File "/tmp/tmpU4RbjA/src/10168/.tox/py27/local/lib/python2.7/site-packages/pip/__init__.py", line 248, in main
return command.main(cmd_args)
File "/tmp/tmpU4RbjA/src/10168/.tox/py27/local/lib/python2.7/site-packages/pip/basecommand.py", line 163, in main
log_file_fp = open_logfile(log_file_fn, 'w')
File "/tmp/tmpU4RbjA/src/10168/.tox/py27/local/lib/python2.7/site-packages/pip/basecommand.py", line 194, in open_logfile
os.makedirs(dirname)
File "/tmp/tmpU4RbjA/src/10168/.tox/py27/lib/python2.7/os.py", line 157, in makedirs
mkdir(name, mode)
OSError: [Errno 13] Permission denied: '/var/lib/narval/.pip'

ERROR: could not install deps [pytz, egenix-mx-base]; v = InvocationError('/tmp/tmpU4RbjA/src/10168/.tox/py27/bin/pip install --pre pytz egenix-mx-base (see /tmp/tmpU4RbjA/src/10168/.tox/py27/log/py27-1.log)', 1)
py34 create: /tmp/tmpU4RbjA/src/10168/.tox/py34
py34 installdeps: pytz
py34 inst: /tmp/tmpU4RbjA/src/10168/.tox/dist/logilab-common-1.0.1.zip
py34 runtests: PYTHONHASHSEED='2559869156'
py34 runtests: commands[0] | pytest -t test
====================== unittest_fileutils.py =======================
..../tmp/tmpU4RbjA/src/10168/.tox/py34/lib/python3.4/site-packages/logilab/common/fileutils.py:291: DeprecationWarning: 'U' mode is deprecated
stream = open(path, 'U')
../tmp/tmpU4RbjA/src/10168/test/unittest_fileutils.py:56: DeprecationWarning: 'U' mode is deprecated
data = open(NEWLINES_TXT, 'U').read()
....
====================== unittest_textutils.py =======================
.........................................
======================== unittest_cache.py =========================
........
========================= unittest_date.py =========================
.........................SSSSSSSSSSSSSSSSSSSSSSS
======================================================================
SKIPPED: test_add_days_worked (unittest_date.MxDateTC)
mx.DateTime is not installed
======================================================================
SKIPPED: test_day (unittest_date.MxDateTC)
enumerate days
mx.DateTime is not installed
======================================================================
SKIPPED: test_get_national_holidays (unittest_date.MxDateTC)
mx.DateTime is not installed
======================================================================
SKIPPED: test_month (unittest_date.MxDateTC)
enumerate months
mx.DateTime is not installed
======================================================================
SKIPPED: test_open_days_afternoon (unittest_date.MxDateTC)
mx.DateTime is not installed
======================================================================
SKIPPED: test_open_days_afternoon_before_holiday (unittest_date.MxDateTC)
mx.DateTime is not installed
======================================================================
SKIPPED: test_open_days_afternoon_before_saturday (unittest_date.MxDateTC)
mx.DateTime is not installed
======================================================================
SKIPPED: test_open_days_day_nextday (unittest_date.MxDateTC)
mx.DateTime is not installed
======================================================================
SKIPPED: test_open_days_friday_monday (unittest_date.MxDateTC)
mx.DateTime is not installed
======================================================================
SKIPPED: test_open_days_friday_monday_with_two_weekends (unittest_date.MxDateTC)
mx.DateTime is not installed
======================================================================
SKIPPED: test_open_days_friday_saturday (unittest_date.MxDateTC)
mx.DateTime is not installed
======================================================================
SKIPPED: test_open_days_friday_sunday (unittest_date.MxDateTC)
mx.DateTime is not installed
======================================================================
SKIPPED: test_open_days_now_and_before (unittest_date.MxDateTC)
mx.DateTime is not installed
======================================================================
SKIPPED: test_open_days_now_now (unittest_date.MxDateTC)
mx.DateTime is not installed
======================================================================
SKIPPED: test_open_days_now_now2 (unittest_date.MxDateTC)
mx.DateTime is not installed
======================================================================
SKIPPED: test_open_days_saturday_monday (unittest_date.MxDateTC)
mx.DateTime is not installed
======================================================================
SKIPPED: test_open_days_saturday_sunday (unittest_date.MxDateTC)
mx.DateTime is not installed
======================================================================
SKIPPED: test_open_days_saturday_tuesday (unittest_date.MxDateTC)
mx.DateTime is not installed
======================================================================
SKIPPED: test_open_days_tuesday_friday (unittest_date.MxDateTC)
mx.DateTime is not installed
======================================================================
SKIPPED: test_open_days_tuesday_wednesday (unittest_date.MxDateTC)
week-end + easter monday
mx.DateTime is not installed
======================================================================
SKIPPED: test_ticks2datetime_before_1900 (unittest_date.MxDateTC)
mx.DateTime is not installed
======================================================================
SKIPPED: test_ustrftime_before_1900 (unittest_date.MxDateTC)
mx.DateTime is not installed
======================================================================
SKIPPED: test_utcdatetime (unittest_date.MxDateTC)
mx.DateTime is not installed
======================= unittest_modutils.py =======================
....................................
==================== unittest_configuration.py =====================
.................
==================== unittest_ureports_html.py =====================
.......
======================== unittest_graph.py =========================
..............
====================== unittest_decorators.py ======================
.............
==================== unittest_ureports_text.py =====================
.......
======================== unittest_pytest.py ========================
/tmp/tmpU4RbjA/src/10168/test/unittest_pytest.py:89: DeprecationWarning: [lgc 0.63.1] Use the pause_trace() context manager
pause_tracing()
/tmp/tmpU4RbjA/src/10168/test/unittest_pytest.py:92: DeprecationWarning: [lgc 0.63.1] Use the pause_trace() context manager
pause_tracing()
/tmp/tmpU4RbjA/src/10168/test/unittest_pytest.py:94: DeprecationWarning: [lgc 0.63.1] Use the pause_trace() context manager
resume_tracing()
/tmp/tmpU4RbjA/src/10168/test/unittest_pytest.py:97: DeprecationWarning: [lgc 0.63.1] Use the pause_trace() context manager
resume_tracing()
......
========================= unittest_tree.py =========================
........................
======================= unittest_umessage.py =======================
....
======================= unittest_xmlutils.py =======================
.....
====================== unittest_shellutils.py ======================
.......................
======================= unittest_testlib.py ========================
........../tmp/tmpU4RbjA/src/10168/.tox/py34/lib/python3.4/site-packages/logilab/common/testlib.py:591: DeprecationWarning: Please use assertTrue instead.
testfunc(*args, **kwargs)
.................................................................../tmp/tmpU4RbjA/src/10168/test/unittest_testlib.py:153: DeprecationWarning: Non-standard: please copy test method to your TestCase class
self.assertDirEqual(ed1, ed2)
/tmp/tmpU4RbjA/src/10168/test/unittest_testlib.py:154: DeprecationWarning: Non-standard: please copy test method to your TestCase class
self.assertDirEqual(ref, ref)
/tmp/tmpU4RbjA/src/10168/.tox/py34/lib/python3.4/site-packages/logilab/common/testlib.py:1004: DeprecationWarning: Non-standard: please copy test method to your TestCase class
osp.join(path_b, ipath_b, ifiles_b[index]))
/tmp/tmpU4RbjA/src/10168/.tox/py34/lib/python3.4/site-packages/logilab/common/testlib.py:943: DeprecationWarning: Non-standard: please copy test method to your TestCase class
msg_prefix='Files differs\n-:%s\n+:%s\n'%(fname1, fname2))
/tmp/tmpU4RbjA/src/10168/test/unittest_testlib.py:155: DeprecationWarning: Non-standard: please copy test method to your TestCase class
self.assertDirEqual( ref, same)
/tmp/tmpU4RbjA/src/10168/.tox/py34/lib/python3.4/site-packages/logilab/common/testlib.py:1095: DeprecationWarning: Non-standard: please copy test method to your TestCase class
callableObj(*args, **kwargs)
../tmp/tmpU4RbjA/src/10168/test/unittest_testlib.py:139: DeprecationWarning: Non-standard: please copy test method to your TestCase class
self.tc.assertFileEqual(foo, foo)
........./tmp/tmpU4RbjA/src/10168/test/unittest_testlib.py:166: DeprecationWarning: Non-standard: please copy test method to your TestCase class
self.tc.assertStreamEqual(stream1, stream1)
../tmp/tmpU4RbjA/src/10168/test/unittest_testlib.py:123: DeprecationWarning: Non-standard: please copy test method to your TestCase class
self.tc.assertXMLStringWellFormed(valid)
...
====================== unittest_changelog.py =======================
.
====================== unittest_taskqueue.py =======================
.....
======================= unittest_registry.py =======================
............
===================== unittest_deprecation.py ======================
.......
======================== unittest_table.py =========================
.....................................
====================== unittest_interface.py =======================
.....
*******************************************************************************
Ran 423 test cases in 11.32s (0.27s CPU), 23 skipped
All 22 modules OK
___________________________________ summary ____________________________________
ERROR: py27: could not install deps [pytz, egenix-mx-base]; v = InvocationError('/tmp/tmpU4RbjA/src/10168/.tox/py27/bin/pip install --pre pytz egenix-mx-base (see /tmp/tmpU4RbjA/src/10168/.tox/py27/log/py27-1.log)', 1)
py34: commands succeeded
<br/>50 Error while running checker tox: `tox` returned with status : 1
Traceback (most recent call last):
File &quot;/tmp/tmpS3FvLt.py&quot;, line 42, in &lt;module&gt;
Command(toxw, [&#39;tox&#39;], raises=True, cwd=dst_dir).run()
File &quot;/usr/lib/python2.7/dist-packages/apycotlib/__init__.py&quot;, line 279, in run
self.handle_output(cmd.returncode, outfile, None)
File &quot;/usr/lib/python2.7/dist-packages/apycotlib/__init__.py&quot;, line 309, in handle_output
raise SetupException(short_msg)
SetupException: `tox` returned with status : 1
<br/>

log from execution