log_file.txt

download

40 tox `tox` returned with status : 1
output:
GLOB sdist-make: /tmp/tmpxytc4D/src/10168/setup.py
WARNING:could not copy distfile to /var/lib/narval/.tox/distshare
py27 create: /tmp/tmpxytc4D/src/10168/.tox/py27
py27 installdeps: pytz, egenix-mx-base
ERROR: invocation failed, logfile: /tmp/tmpxytc4D/src/10168/.tox/py27/log/py27-1.log
ERROR: actionid=py27
msg=getenv
cmdargs=[local('/tmp/tmpxytc4D/src/10168/.tox/py27/bin/pip'), 'install', '--pre', 'pytz', 'egenix-mx-base']
env={'LANGUAGE': 'en_US:en', 'VIRTUAL_ENV': '/tmp/tmpxytc4D/src/10168/.tox/py27', 'HOME': '/var/lib/narval', 'LC_ALL': 'fr_FR.UTF-8', 'PWD': '/', 'DISPLAY': ':1.0', '_SYSTEMCTL_SKIP_REDIRECT': 'true', 'COLUMNS': '80', 'HGRCPATH': '/dev/null', 'PYTHONHASHSEED': '339914365', 'APYCOT_ROOT': '/tmp/tmpxytc4D', 'LINES': '24', 'PATH': '/tmp/tmpxytc4D/src/10168/.tox/py27/bin:/sbin/:/usr/local/sbin:/usr/local/bin:/usr/sbin:/usr/bin:/sbin:/bin', 'LANG': 'en_US.UTF-8', 'PYTHONPATH': '/usr/share/narval:/usr/share/narval'}
Downloading/unpacking pytz
Downloading/unpacking egenix-mx-base
Running setup.py (path:/tmp/pip-build-bXHEkN/egenix-mx-base/setup.py) egg_info for package egenix-mx-base
Installing collected packages: pytz, egenix-mx-base
Running setup.py install for egenix-mx-base
found usable build data file 'build/build-py2.7_ucs4.pck'
prebuilt archive found: skipping the build process and reusing the existing build files and data
setting platform to 'linux-x86_64'
restoring build data from a previous build run
skipping the build process and reusing existing build files
configured compiler
checking compiler setup
x86_64-linux-gnu-gcc -pthread -DNDEBUG -g -fwrapv -O2 -Wall -Wstrict-prototypes -fno-strict-aliasing -D_FORTIFY_SOURCE=2 -g -fstack-protector-strong -Wformat -Werror=format-security -fPIC -I/usr/local/include -I/tmp/tmpxytc4D/src/10168/.tox/py27/include -I/tmp/tmpxytc4D/src/10168/.tox/py27/local/include/python2.7 -c _configtest.c -o _configtest.o
x86_64-linux-gnu-gcc -pthread _configtest.o -L/usr/local/lib -L/tmp/tmpxytc4D/src/10168/.tox/py27/lib -o _configtest
success!
removing: _configtest.c _configtest.o _configtest
compiler setup works
checking for availability of strftime() (errors from this can safely be ignored)
x86_64-linux-gnu-gcc -pthread -DNDEBUG -g -fwrapv -O2 -Wall -Wstrict-prototypes -fno-strict-aliasing -D_FORTIFY_SOURCE=2 -g -fstack-protector-strong -Wformat -Werror=format-security -fPIC -D_GNU_SOURCE=1 -I/usr/local/include -I/tmp/tmpxytc4D/src/10168/.tox/py27/include -I/tmp/tmpxytc4D/src/10168/.tox/py27/local/include/python2.7 -c _configtest.c -o _configtest.o
_configtest.c: In function ‘main’:
_configtest.c:4:9: warning: variable ‘ptr’ set but not used [-Wunused-but-set-variable]
void *ptr = 0;
^
x86_64-linux-gnu-gcc -pthread _configtest.o -L/usr/local/lib -L/tmp/tmpxytc4D/src/10168/.tox/py27/lib -o _configtest
success!
removing: _configtest.c _configtest.o _configtest
strftime() is available on this platform
checking for availability of strptime() (errors from this can safely be ignored)
x86_64-linux-gnu-gcc -pthread -DNDEBUG -g -fwrapv -O2 -Wall -Wstrict-prototypes -fno-strict-aliasing -D_FORTIFY_SOURCE=2 -g -fstack-protector-strong -Wformat -Werror=format-security -fPIC -D_GNU_SOURCE=1 -I/usr/local/include -I/tmp/tmpxytc4D/src/10168/.tox/py27/include -I/tmp/tmpxytc4D/src/10168/.tox/py27/local/include/python2.7 -c _configtest.c -o _configtest.o
_configtest.c: In function ‘main’:
_configtest.c:4:9: warning: variable ‘ptr’ set but not used [-Wunused-but-set-variable]
void *ptr = 0;
^
x86_64-linux-gnu-gcc -pthread _configtest.o -L/usr/local/lib -L/tmp/tmpxytc4D/src/10168/.tox/py27/lib -o _configtest
success!
removing: _configtest.c _configtest.o _configtest
strptime() is available on this platform
checking for availability of timegm() (errors from this can safely be ignored)
x86_64-linux-gnu-gcc -pthread -DNDEBUG -g -fwrapv -O2 -Wall -Wstrict-prototypes -fno-strict-aliasing -D_FORTIFY_SOURCE=2 -g -fstack-protector-strong -Wformat -Werror=format-security -fPIC -D_GNU_SOURCE=1 -I/usr/local/include -I/tmp/tmpxytc4D/src/10168/.tox/py27/include -I/tmp/tmpxytc4D/src/10168/.tox/py27/local/include/python2.7 -c _configtest.c -o _configtest.o
_configtest.c: In function ‘main’:
_configtest.c:4:9: warning: variable ‘ptr’ set but not used [-Wunused-but-set-variable]
void *ptr = 0;
^
x86_64-linux-gnu-gcc -pthread _configtest.o -L/usr/local/lib -L/tmp/tmpxytc4D/src/10168/.tox/py27/lib -o _configtest
success!
removing: _configtest.c _configtest.o _configtest
timegm() is available on this platform
checking for availability of clock_gettime() (errors from this can safely be ignored)
x86_64-linux-gnu-gcc -pthread -DNDEBUG -g -fwrapv -O2 -Wall -Wstrict-prototypes -fno-strict-aliasing -D_FORTIFY_SOURCE=2 -g -fstack-protector-strong -Wformat -Werror=format-security -fPIC -D_GNU_SOURCE=1 -I/usr/local/include -I/tmp/tmpxytc4D/src/10168/.tox/py27/include -I/tmp/tmpxytc4D/src/10168/.tox/py27/local/include/python2.7 -c _configtest.c -o _configtest.o
_configtest.c: In function ‘main’:
_configtest.c:4:9: warning: variable ‘ptr’ set but not used [-Wunused-but-set-variable]
void *ptr = 0;
^
x86_64-linux-gnu-gcc -pthread _configtest.o -L/usr/local/lib -L/tmp/tmpxytc4D/src/10168/.tox/py27/lib -o _configtest
success!
removing: _configtest.c _configtest.o _configtest
clock_gettime() is available on this platform
checking for availability of clock_getres() (errors from this can safely be ignored)
x86_64-linux-gnu-gcc -pthread -DNDEBUG -g -fwrapv -O2 -Wall -Wstrict-prototypes -fno-strict-aliasing -D_FORTIFY_SOURCE=2 -g -fstack-protector-strong -Wformat -Werror=format-security -fPIC -D_GNU_SOURCE=1 -I/usr/local/include -I/tmp/tmpxytc4D/src/10168/.tox/py27/include -I/tmp/tmpxytc4D/src/10168/.tox/py27/local/include/python2.7 -c _configtest.c -o _configtest.o
_configtest.c: In function ‘main’:
_configtest.c:4:9: warning: variable ‘ptr’ set but not used [-Wunused-but-set-variable]
void *ptr = 0;
^
x86_64-linux-gnu-gcc -pthread _configtest.o -L/usr/local/lib -L/tmp/tmpxytc4D/src/10168/.tox/py27/lib -o _configtest
success!
removing: _configtest.c _configtest.o _configtest
clock_getres() is available on this platform
checking compiler for bad static forward handling (errors from this can safely be ignored)
x86_64-linux-gnu-gcc -pthread -DNDEBUG -g -fwrapv -O2 -Wall -Wstrict-prototypes -fno-strict-aliasing -D_FORTIFY_SOURCE=2 -g -fstack-protector-strong -Wformat -Werror=format-security -fPIC -D_GNU_SOURCE=1 -I/tmp/tmpxytc4D/src/10168/.tox/py27/local/include/python2.7 -I/usr/local/include -I/tmp/tmpxytc4D/src/10168/.tox/py27/include -I/tmp/tmpxytc4D/src/10168/.tox/py27/local/include/python2.7 -c _configtest.c -o _configtest.o
success!
removing: _configtest.c _configtest.o
setting mx platform id to 'Linux x64'
macros to define: [('HAVE_STRFTIME', '1'), ('HAVE_STRPTIME', '1'), ('HAVE_TIMEGM', '1'), ('HAVE_CLOCK_GETTIME', '1'), ('HAVE_CLOCK_GETRES', '1'), ('MX_PLATFORM_ID', '"Linux x64"')]
macros to undefine: []

building extension "mx.DateTime.mxDateTime.mxDateTime" (required)
checking for optional libraries
x86_64-linux-gnu-gcc -pthread -DNDEBUG -g -fwrapv -O2 -Wall -Wstrict-prototypes -fno-strict-aliasing -D_FORTIFY_SOURCE=2 -g -fstack-protector-strong -Wformat -Werror=format-security -fPIC -DHAVE_STRFTIME=1 -DHAVE_STRPTIME=1 -DHAVE_TIMEGM=1 -DHAVE_CLOCK_GETTIME=1 -DHAVE_CLOCK_GETRES=1 -DMX_PLATFORM_ID="Linux x64" -I/usr/include/python2.7 -c _configtest.c -o _configtest.o
x86_64-linux-gnu-gcc -pthread _configtest.o -lm -o _configtest
success!
removing: _configtest.c _configtest.o _configtest
found optional library 'm' -- defining HAVE_M_LIB
x86_64-linux-gnu-gcc -pthread -DNDEBUG -g -fwrapv -O2 -Wall -Wstrict-prototypes -fno-strict-aliasing -D_FORTIFY_SOURCE=2 -g -fstack-protector-strong -Wformat -Werror=format-security -fPIC -DHAVE_STRFTIME=1 -DHAVE_STRPTIME=1 -DHAVE_TIMEGM=1 -DHAVE_CLOCK_GETTIME=1 -DHAVE_CLOCK_GETRES=1 -DMX_PLATFORM_ID="Linux x64" -I/usr/include/python2.7 -c _configtest.c -o _configtest.o
x86_64-linux-gnu-gcc -pthread _configtest.o -lrt -o _configtest
success!
removing: _configtest.c _configtest.o _configtest
found optional library 'rt' -- defining HAVE_RT_LIB
building 'mx.DateTime.mxDateTime.mxDateTime' extension
x86_64-linux-gnu-gcc -pthread -DNDEBUG -g -fwrapv -O2 -Wall -Wstrict-prototypes -fno-strict-aliasing -D_FORTIFY_SOURCE=2 -g -fstack-protector-strong -Wformat -Werror=format-security -fPIC -DUSE_FAST_GETCURRENTTIME -DHAVE_M_LIB=1 -DHAVE_RT_LIB=1 -DHAVE_STRFTIME=1 -DHAVE_STRPTIME=1 -DHAVE_TIMEGM=1 -DHAVE_CLOCK_GETTIME=1 -DHAVE_CLOCK_GETRES=1 -DMX_PLATFORM_ID="Linux x64" -Imx/DateTime/mxDateTime -I/usr/include/python2.7 -c mx/DateTime/mxDateTime/mxDateTime.c -o build/temp.linux-x86_64-2.7_ucs4/mx-DateTime-mxDateTime-mxDateTime/mx/DateTime/mxDateTime/mxDateTime.o
x86_64-linux-gnu-gcc: error: mx/DateTime/mxDateTime/mxDateTime.c: No such file or directory
x86_64-linux-gnu-gcc: fatal error: no input files
compilation terminated.
error: command 'x86_64-linux-gnu-gcc' failed with exit status 4
Complete output from command /tmp/tmpxytc4D/src/10168/.tox/py27/bin/python2.7 -c "import setuptools, tokenize;__file__='/tmp/pip-build-bXHEkN/egenix-mx-base/setup.py';exec(compile(getattr(tokenize, 'open', open)(__file__).read().replace('\r\n', '\n'), __file__, 'exec'))" install --record /tmp/pip-IH65T0-record/install-record.txt --single-version-externally-managed --compile --install-headers /tmp/tmpxytc4D/src/10168/.tox/py27/include/site/python2.7:
running install

found usable build data file 'build/build-py2.7_ucs4.pck'

prebuilt archive found: skipping the build process and reusing the existing build files and data

setting platform to 'linux-x86_64'

restoring build data from a previous build run

running build

skipping the build process and reusing existing build files

running install_lib

running build_ext

running mx_autoconf

configured compiler

checking compiler setup

x86_64-linux-gnu-gcc -pthread -DNDEBUG -g -fwrapv -O2 -Wall -Wstrict-prototypes -fno-strict-aliasing -D_FORTIFY_SOURCE=2 -g -fstack-protector-strong -Wformat -Werror=format-security -fPIC -I/usr/local/include -I/tmp/tmpxytc4D/src/10168/.tox/py27/include -I/tmp/tmpxytc4D/src/10168/.tox/py27/local/include/python2.7 -c _configtest.c -o _configtest.o

x86_64-linux-gnu-gcc -pthread _configtest.o -L/usr/local/lib -L/tmp/tmpxytc4D/src/10168/.tox/py27/lib -o _configtest

success!

removing: _configtest.c _configtest.o _configtest

compiler setup works

checking for availability of strftime() (errors from this can safely be ignored)

x86_64-linux-gnu-gcc -pthread -DNDEBUG -g -fwrapv -O2 -Wall -Wstrict-prototypes -fno-strict-aliasing -D_FORTIFY_SOURCE=2 -g -fstack-protector-strong -Wformat -Werror=format-security -fPIC -D_GNU_SOURCE=1 -I/usr/local/include -I/tmp/tmpxytc4D/src/10168/.tox/py27/include -I/tmp/tmpxytc4D/src/10168/.tox/py27/local/include/python2.7 -c _configtest.c -o _configtest.o

_configtest.c: In function ‘main’:

_configtest.c:4:9: warning: variable ‘ptr’ set but not used [-Wunused-but-set-variable]

void *ptr = 0;

^

x86_64-linux-gnu-gcc -pthread _configtest.o -L/usr/local/lib -L/tmp/tmpxytc4D/src/10168/.tox/py27/lib -o _configtest

success!

removing: _configtest.c _configtest.o _configtest

strftime() is available on this platform

checking for availability of strptime() (errors from this can safely be ignored)

x86_64-linux-gnu-gcc -pthread -DNDEBUG -g -fwrapv -O2 -Wall -Wstrict-prototypes -fno-strict-aliasing -D_FORTIFY_SOURCE=2 -g -fstack-protector-strong -Wformat -Werror=format-security -fPIC -D_GNU_SOURCE=1 -I/usr/local/include -I/tmp/tmpxytc4D/src/10168/.tox/py27/include -I/tmp/tmpxytc4D/src/10168/.tox/py27/local/include/python2.7 -c _configtest.c -o _configtest.o

_configtest.c: In function ‘main’:

_configtest.c:4:9: warning: variable ‘ptr’ set but not used [-Wunused-but-set-variable]

void *ptr = 0;

^

x86_64-linux-gnu-gcc -pthread _configtest.o -L/usr/local/lib -L/tmp/tmpxytc4D/src/10168/.tox/py27/lib -o _configtest

success!

removing: _configtest.c _configtest.o _configtest

strptime() is available on this platform

checking for availability of timegm() (errors from this can safely be ignored)

x86_64-linux-gnu-gcc -pthread -DNDEBUG -g -fwrapv -O2 -Wall -Wstrict-prototypes -fno-strict-aliasing -D_FORTIFY_SOURCE=2 -g -fstack-protector-strong -Wformat -Werror=format-security -fPIC -D_GNU_SOURCE=1 -I/usr/local/include -I/tmp/tmpxytc4D/src/10168/.tox/py27/include -I/tmp/tmpxytc4D/src/10168/.tox/py27/local/include/python2.7 -c _configtest.c -o _configtest.o

_configtest.c: In function ‘main’:

_configtest.c:4:9: warning: variable ‘ptr’ set but not used [-Wunused-but-set-variable]

void *ptr = 0;

^

x86_64-linux-gnu-gcc -pthread _configtest.o -L/usr/local/lib -L/tmp/tmpxytc4D/src/10168/.tox/py27/lib -o _configtest

success!

removing: _configtest.c _configtest.o _configtest

timegm() is available on this platform

checking for availability of clock_gettime() (errors from this can safely be ignored)

x86_64-linux-gnu-gcc -pthread -DNDEBUG -g -fwrapv -O2 -Wall -Wstrict-prototypes -fno-strict-aliasing -D_FORTIFY_SOURCE=2 -g -fstack-protector-strong -Wformat -Werror=format-security -fPIC -D_GNU_SOURCE=1 -I/usr/local/include -I/tmp/tmpxytc4D/src/10168/.tox/py27/include -I/tmp/tmpxytc4D/src/10168/.tox/py27/local/include/python2.7 -c _configtest.c -o _configtest.o

_configtest.c: In function ‘main’:

_configtest.c:4:9: warning: variable ‘ptr’ set but not used [-Wunused-but-set-variable]

void *ptr = 0;

^

x86_64-linux-gnu-gcc -pthread _configtest.o -L/usr/local/lib -L/tmp/tmpxytc4D/src/10168/.tox/py27/lib -o _configtest

success!

removing: _configtest.c _configtest.o _configtest

clock_gettime() is available on this platform

checking for availability of clock_getres() (errors from this can safely be ignored)

x86_64-linux-gnu-gcc -pthread -DNDEBUG -g -fwrapv -O2 -Wall -Wstrict-prototypes -fno-strict-aliasing -D_FORTIFY_SOURCE=2 -g -fstack-protector-strong -Wformat -Werror=format-security -fPIC -D_GNU_SOURCE=1 -I/usr/local/include -I/tmp/tmpxytc4D/src/10168/.tox/py27/include -I/tmp/tmpxytc4D/src/10168/.tox/py27/local/include/python2.7 -c _configtest.c -o _configtest.o

_configtest.c: In function ‘main’:

_configtest.c:4:9: warning: variable ‘ptr’ set but not used [-Wunused-but-set-variable]

void *ptr = 0;

^

x86_64-linux-gnu-gcc -pthread _configtest.o -L/usr/local/lib -L/tmp/tmpxytc4D/src/10168/.tox/py27/lib -o _configtest

success!

removing: _configtest.c _configtest.o _configtest

clock_getres() is available on this platform

checking compiler for bad static forward handling (errors from this can safely be ignored)

x86_64-linux-gnu-gcc -pthread -DNDEBUG -g -fwrapv -O2 -Wall -Wstrict-prototypes -fno-strict-aliasing -D_FORTIFY_SOURCE=2 -g -fstack-protector-strong -Wformat -Werror=format-security -fPIC -D_GNU_SOURCE=1 -I/tmp/tmpxytc4D/src/10168/.tox/py27/local/include/python2.7 -I/usr/local/include -I/tmp/tmpxytc4D/src/10168/.tox/py27/include -I/tmp/tmpxytc4D/src/10168/.tox/py27/local/include/python2.7 -c _configtest.c -o _configtest.o

success!

removing: _configtest.c _configtest.o

setting mx platform id to 'Linux x64'

macros to define: [('HAVE_STRFTIME', '1'), ('HAVE_STRPTIME', '1'), ('HAVE_TIMEGM', '1'), ('HAVE_CLOCK_GETTIME', '1'), ('HAVE_CLOCK_GETRES', '1'), ('MX_PLATFORM_ID', '"Linux x64"')]

macros to undefine: []

building extension "mx.DateTime.mxDateTime.mxDateTime" (required)

checking for optional libraries

x86_64-linux-gnu-gcc -pthread -DNDEBUG -g -fwrapv -O2 -Wall -Wstrict-prototypes -fno-strict-aliasing -D_FORTIFY_SOURCE=2 -g -fstack-protector-strong -Wformat -Werror=format-security -fPIC -DHAVE_STRFTIME=1 -DHAVE_STRPTIME=1 -DHAVE_TIMEGM=1 -DHAVE_CLOCK_GETTIME=1 -DHAVE_CLOCK_GETRES=1 -DMX_PLATFORM_ID="Linux x64" -I/usr/include/python2.7 -c _configtest.c -o _configtest.o

x86_64-linux-gnu-gcc -pthread _configtest.o -lm -o _configtest

success!

removing: _configtest.c _configtest.o _configtest

found optional library 'm' -- defining HAVE_M_LIB

x86_64-linux-gnu-gcc -pthread -DNDEBUG -g -fwrapv -O2 -Wall -Wstrict-prototypes -fno-strict-aliasing -D_FORTIFY_SOURCE=2 -g -fstack-protector-strong -Wformat -Werror=format-security -fPIC -DHAVE_STRFTIME=1 -DHAVE_STRPTIME=1 -DHAVE_TIMEGM=1 -DHAVE_CLOCK_GETTIME=1 -DHAVE_CLOCK_GETRES=1 -DMX_PLATFORM_ID="Linux x64" -I/usr/include/python2.7 -c _configtest.c -o _configtest.o

x86_64-linux-gnu-gcc -pthread _configtest.o -lrt -o _configtest

success!

removing: _configtest.c _configtest.o _configtest

found optional library 'rt' -- defining HAVE_RT_LIB

building 'mx.DateTime.mxDateTime.mxDateTime' extension

creating build/temp.linux-x86_64-2.7_ucs4

creating build/temp.linux-x86_64-2.7_ucs4/mx-DateTime-mxDateTime-mxDateTime

creating build/temp.linux-x86_64-2.7_ucs4/mx-DateTime-mxDateTime-mxDateTime/mx

creating build/temp.linux-x86_64-2.7_ucs4/mx-DateTime-mxDateTime-mxDateTime/mx/DateTime

creating build/temp.linux-x86_64-2.7_ucs4/mx-DateTime-mxDateTime-mxDateTime/mx/DateTime/mxDateTime

x86_64-linux-gnu-gcc -pthread -DNDEBUG -g -fwrapv -O2 -Wall -Wstrict-prototypes -fno-strict-aliasing -D_FORTIFY_SOURCE=2 -g -fstack-protector-strong -Wformat -Werror=format-security -fPIC -DUSE_FAST_GETCURRENTTIME -DHAVE_M_LIB=1 -DHAVE_RT_LIB=1 -DHAVE_STRFTIME=1 -DHAVE_STRPTIME=1 -DHAVE_TIMEGM=1 -DHAVE_CLOCK_GETTIME=1 -DHAVE_CLOCK_GETRES=1 -DMX_PLATFORM_ID="Linux x64" -Imx/DateTime/mxDateTime -I/usr/include/python2.7 -c mx/DateTime/mxDateTime/mxDateTime.c -o build/temp.linux-x86_64-2.7_ucs4/mx-DateTime-mxDateTime-mxDateTime/mx/DateTime/mxDateTime/mxDateTime.o

x86_64-linux-gnu-gcc: error: mx/DateTime/mxDateTime/mxDateTime.c: No such file or directory

x86_64-linux-gnu-gcc: fatal error: no input files

compilation terminated.

error: command 'x86_64-linux-gnu-gcc' failed with exit status 4

----------------------------------------
Cleaning up...
Command /tmp/tmpxytc4D/src/10168/.tox/py27/bin/python2.7 -c "import setuptools, tokenize;__file__='/tmp/pip-build-bXHEkN/egenix-mx-base/setup.py';exec(compile(getattr(tokenize, 'open', open)(__file__).read().replace('\r\n', '\n'), __file__, 'exec'))" install --record /tmp/pip-IH65T0-record/install-record.txt --single-version-externally-managed --compile --install-headers /tmp/tmpxytc4D/src/10168/.tox/py27/include/site/python2.7 failed with error code 1 in /tmp/pip-build-bXHEkN/egenix-mx-base
Traceback (most recent call last):
File ".tox/py27/bin/pip", line 11, in <module>
sys.exit(main())
File "/tmp/tmpxytc4D/src/10168/.tox/py27/local/lib/python2.7/site-packages/pip/__init__.py", line 248, in main
return command.main(cmd_args)
File "/tmp/tmpxytc4D/src/10168/.tox/py27/local/lib/python2.7/site-packages/pip/basecommand.py", line 161, in main
text = '\n'.join(complete_log)
UnicodeDecodeError: 'ascii' codec can't decode byte 0xe2 in position 31: ordinal not in range(128)

ERROR: could not install deps [pytz, egenix-mx-base]; v = InvocationError('/tmp/tmpxytc4D/src/10168/.tox/py27/bin/pip install --pre pytz egenix-mx-base (see /tmp/tmpxytc4D/src/10168/.tox/py27/log/py27-1.log)', 1)
py34 create: /tmp/tmpxytc4D/src/10168/.tox/py34
py34 installdeps: pytz
py34 inst: /tmp/tmpxytc4D/src/10168/.tox/dist/logilab-common-1.0.0.zip
py34 runtests: PYTHONHASHSEED='339914365'
py34 runtests: commands[0] | pytest -t test
======================= unittest_testlib.py ========================
........../tmp/tmpxytc4D/src/10168/.tox/py34/lib/python3.4/site-packages/logilab/common/testlib.py:591: DeprecationWarning: Please use assertTrue instead.
testfunc(*args, **kwargs)
.................................................................../tmp/tmpxytc4D/src/10168/test/unittest_testlib.py:153: DeprecationWarning: Non-standard: please copy test method to your TestCase class
self.assertDirEqual(ed1, ed2)
/tmp/tmpxytc4D/src/10168/test/unittest_testlib.py:154: DeprecationWarning: Non-standard: please copy test method to your TestCase class
self.assertDirEqual(ref, ref)
/tmp/tmpxytc4D/src/10168/.tox/py34/lib/python3.4/site-packages/logilab/common/testlib.py:1004: DeprecationWarning: Non-standard: please copy test method to your TestCase class
osp.join(path_b, ipath_b, ifiles_b[index]))
/tmp/tmpxytc4D/src/10168/.tox/py34/lib/python3.4/site-packages/logilab/common/testlib.py:943: DeprecationWarning: Non-standard: please copy test method to your TestCase class
msg_prefix='Files differs\n-:%s\n+:%s\n'%(fname1, fname2))
/tmp/tmpxytc4D/src/10168/test/unittest_testlib.py:155: DeprecationWarning: Non-standard: please copy test method to your TestCase class
self.assertDirEqual( ref, same)
/tmp/tmpxytc4D/src/10168/.tox/py34/lib/python3.4/site-packages/logilab/common/testlib.py:1095: DeprecationWarning: Non-standard: please copy test method to your TestCase class
callableObj(*args, **kwargs)
../tmp/tmpxytc4D/src/10168/test/unittest_testlib.py:139: DeprecationWarning: Non-standard: please copy test method to your TestCase class
self.tc.assertFileEqual(foo, foo)
........./tmp/tmpxytc4D/src/10168/test/unittest_testlib.py:166: DeprecationWarning: Non-standard: please copy test method to your TestCase class
self.tc.assertStreamEqual(stream1, stream1)
../tmp/tmpxytc4D/src/10168/test/unittest_testlib.py:123: DeprecationWarning: Non-standard: please copy test method to your TestCase class
self.tc.assertXMLStringWellFormed(valid)
...
====================== unittest_interface.py =======================
.....
========================= unittest_tree.py =========================
........................
===================== unittest_deprecation.py ======================
.......
==================== unittest_configuration.py =====================
.................
====================== unittest_fileutils.py =======================
..../tmp/tmpxytc4D/src/10168/.tox/py34/lib/python3.4/site-packages/logilab/common/fileutils.py:291: DeprecationWarning: 'U' mode is deprecated
stream = open(path, 'U')
../tmp/tmpxytc4D/src/10168/test/unittest_fileutils.py:56: DeprecationWarning: 'U' mode is deprecated
data = open(NEWLINES_TXT, 'U').read()
....
====================== unittest_textutils.py =======================
.........................................
======================= unittest_xmlutils.py =======================
.....
====================== unittest_changelog.py =======================
.
====================== unittest_decorators.py ======================
.............
======================= unittest_umessage.py =======================
....
======================== unittest_table.py =========================
.....................................
======================== unittest_graph.py =========================
..............
====================== unittest_shellutils.py ======================
.......................
======================== unittest_cache.py =========================
........
====================== unittest_taskqueue.py =======================
.....
==================== unittest_ureports_html.py =====================
.......
========================= unittest_date.py =========================
.........................SSSSSSSSSSSSSSSSSSSSSSS
======================================================================
SKIPPED: test_add_days_worked (unittest_date.MxDateTC)
mx.DateTime is not installed
======================================================================
SKIPPED: test_day (unittest_date.MxDateTC)
enumerate days
mx.DateTime is not installed
======================================================================
SKIPPED: test_get_national_holidays (unittest_date.MxDateTC)
mx.DateTime is not installed
======================================================================
SKIPPED: test_month (unittest_date.MxDateTC)
enumerate months
mx.DateTime is not installed
======================================================================
SKIPPED: test_open_days_afternoon (unittest_date.MxDateTC)
mx.DateTime is not installed
======================================================================
SKIPPED: test_open_days_afternoon_before_holiday (unittest_date.MxDateTC)
mx.DateTime is not installed
======================================================================
SKIPPED: test_open_days_afternoon_before_saturday (unittest_date.MxDateTC)
mx.DateTime is not installed
======================================================================
SKIPPED: test_open_days_day_nextday (unittest_date.MxDateTC)
mx.DateTime is not installed
======================================================================
SKIPPED: test_open_days_friday_monday (unittest_date.MxDateTC)
mx.DateTime is not installed
======================================================================
SKIPPED: test_open_days_friday_monday_with_two_weekends (unittest_date.MxDateTC)
mx.DateTime is not installed
======================================================================
SKIPPED: test_open_days_friday_saturday (unittest_date.MxDateTC)
mx.DateTime is not installed
======================================================================
SKIPPED: test_open_days_friday_sunday (unittest_date.MxDateTC)
mx.DateTime is not installed
======================================================================
SKIPPED: test_open_days_now_and_before (unittest_date.MxDateTC)
mx.DateTime is not installed
======================================================================
SKIPPED: test_open_days_now_now (unittest_date.MxDateTC)
mx.DateTime is not installed
======================================================================
SKIPPED: test_open_days_now_now2 (unittest_date.MxDateTC)
mx.DateTime is not installed
======================================================================
SKIPPED: test_open_days_saturday_monday (unittest_date.MxDateTC)
mx.DateTime is not installed
======================================================================
SKIPPED: test_open_days_saturday_sunday (unittest_date.MxDateTC)
mx.DateTime is not installed
======================================================================
SKIPPED: test_open_days_saturday_tuesday (unittest_date.MxDateTC)
mx.DateTime is not installed
======================================================================
SKIPPED: test_open_days_tuesday_friday (unittest_date.MxDateTC)
mx.DateTime is not installed
======================================================================
SKIPPED: test_open_days_tuesday_wednesday (unittest_date.MxDateTC)
week-end + easter monday
mx.DateTime is not installed
======================================================================
SKIPPED: test_ticks2datetime_before_1900 (unittest_date.MxDateTC)
mx.DateTime is not installed
======================================================================
SKIPPED: test_ustrftime_before_1900 (unittest_date.MxDateTC)
mx.DateTime is not installed
======================================================================
SKIPPED: test_utcdatetime (unittest_date.MxDateTC)
mx.DateTime is not installed
======================== unittest_pytest.py ========================
/tmp/tmpxytc4D/src/10168/test/unittest_pytest.py:89: DeprecationWarning: [lgc 0.63.1] Use the pause_trace() context manager
pause_tracing()
/tmp/tmpxytc4D/src/10168/test/unittest_pytest.py:92: DeprecationWarning: [lgc 0.63.1] Use the pause_trace() context manager
pause_tracing()
/tmp/tmpxytc4D/src/10168/test/unittest_pytest.py:94: DeprecationWarning: [lgc 0.63.1] Use the pause_trace() context manager
resume_tracing()
/tmp/tmpxytc4D/src/10168/test/unittest_pytest.py:97: DeprecationWarning: [lgc 0.63.1] Use the pause_trace() context manager
resume_tracing()
......
======================= unittest_registry.py =======================
............
==================== unittest_ureports_text.py =====================
.......
======================= unittest_modutils.py =======================
....................................
*******************************************************************************
Ran 423 test cases in 11.25s (0.24s CPU), 23 skipped
All 22 modules OK
___________________________________ summary ____________________________________
ERROR: py27: could not install deps [pytz, egenix-mx-base]; v = InvocationError('/tmp/tmpxytc4D/src/10168/.tox/py27/bin/pip install --pre pytz egenix-mx-base (see /tmp/tmpxytc4D/src/10168/.tox/py27/log/py27-1.log)', 1)
py34: commands succeeded
<br/>50 Error while running checker tox: `tox` returned with status : 1
Traceback (most recent call last):
File &quot;/tmp/tmpLrnT40.py&quot;, line 42, in &lt;module&gt;
Command(toxw, [&#39;tox&#39;], raises=True, cwd=dst_dir).run()
File &quot;/usr/lib/python2.7/dist-packages/apycotlib/__init__.py&quot;, line 279, in run
self.handle_output(cmd.returncode, outfile, None)
File &quot;/usr/lib/python2.7/dist-packages/apycotlib/__init__.py&quot;, line 309, in handle_output
raise SetupException(short_msg)
SetupException: `tox` returned with status : 1
<br/>

log from execution