log_file.txt

download

40 tox `tox` returned with status : 1
output:
GLOB sdist-make: /tmp/tmpL7HWiJ/src/10168/setup.py
WARNING:could not copy distfile to /var/lib/narval/.tox/distshare
py27 create: /tmp/tmpL7HWiJ/src/10168/.tox/py27
py27 inst: /tmp/tmpL7HWiJ/src/10168/.tox/dist/logilab-common-1.0.0.zip
py27 runtests: PYTHONHASHSEED='3961173614'
py27 runtests: commands[0] | pytest
========================= test_develop.py ==========================
.
======================= test_integration.py ========================
unhandled exception occurred while testing test_integration
Traceback (most recent call last):
File "/tmp/tmpL7HWiJ/src/10168/.tox/py27/local/lib/python2.7/site-packages/logilab/common/pytest.py", line 440, in testfile
options=self.options, outstream=sys.stderr)
File "/tmp/tmpL7HWiJ/src/10168/.tox/py27/local/lib/python2.7/site-packages/logilab/common/pytest.py", line 756, in __init__
testLoader=NonStrictTestLoader())
File "/usr/lib/python2.7/unittest/main.py", line 77, in __init__
self.module = __import__(module)
File "test_integration.py", line 10, in <module>
import pytest
ImportError: No module named pytest
======================= test_upload_docs.py ========================
.
====================== test_find_packages.py =======================
...........
======================== test_markerlib.py =========================
.
======================== test_bdist_egg.py =========================
zip_safe flag not set; analyzing archive contents...
.
======================== test_resources.py =========================
unhandled exception occurred while testing test_resources
Traceback (most recent call last):
File "/tmp/tmpL7HWiJ/src/10168/.tox/py27/local/lib/python2.7/site-packages/logilab/common/pytest.py", line 440, in testfile
options=self.options, outstream=sys.stderr)
File "/tmp/tmpL7HWiJ/src/10168/.tox/py27/local/lib/python2.7/site-packages/logilab/common/pytest.py", line 756, in __init__
testLoader=NonStrictTestLoader())
File "/usr/lib/python2.7/unittest/main.py", line 77, in __init__
self.module = __import__(module)
File "test_resources.py", line 19, in <module>
from .py26compat import skipIf
ValueError: Attempted relative import in non-package
=========================== test_svn.py ============================
svn, version 1.8.10 (r1615264)
compiled Apr 1 2015, 02:54:56 on x86_64-pc-linux-gnu

Copyright (C) 2014 The Apache Software Foundation.
This software consists of contributions made by many people;
see the NOTICE file for more information.
Subversion is open source software, see http://subversion.apache.org/

The following repository access (RA) modules are available:

* ra_svn : Module for accessing a repository using the svn network protocol.
- with Cyrus SASL authentication
- handles 'svn' scheme
* ra_local : Module for accessing a repository on local disk.
- handles 'file' scheme
* ra_serf : Module for accessing a repository via WebDAV protocol using serf.
- using serf 1.3.8
- handles 'http' scheme
- handles 'https' scheme

EEEEEEEEEEEEEEEEFFF..
======================================================================
ERROR: test_svn13 (test_svn.ParseExternal)
----------------------------------------------------------------------
Traceback (most recent call last)
File "/usr/lib/python2.7/unittest/case.py", line 329, in run
testMethod()
File "/tmp/tmpL7HWiJ/src/10168/.tox/py27/lib/python2.7/site-packages/setuptools/tests/test_svn.py", line 166, in test_svn13
self.parse_tester('svn13', False)
File "/tmp/tmpL7HWiJ/src/10168/.tox/py27/lib/python2.7/site-packages/setuptools/tests/test_svn.py", line 154, in parse_tester
data = _read_utf8_file(path)
File "/tmp/tmpL7HWiJ/src/10168/.tox/py27/lib/python2.7/site-packages/setuptools/tests/test_svn.py", line 56, in _read_utf8_file
fileobj = io.open(path, 'r', encoding='utf-8')
IOError: [Errno 2] No such file or directory: 'setuptools/tests/svn_data/svn13_ext_list.txt'

no stdout
no stderr
======================================================================
ERROR: test_svn14 (test_svn.ParseExternal)
----------------------------------------------------------------------
Traceback (most recent call last)
File "/usr/lib/python2.7/unittest/case.py", line 329, in run
testMethod()
File "/tmp/tmpL7HWiJ/src/10168/.tox/py27/lib/python2.7/site-packages/setuptools/tests/test_svn.py", line 169, in test_svn14
self.parse_tester('svn14', False)
File "/tmp/tmpL7HWiJ/src/10168/.tox/py27/lib/python2.7/site-packages/setuptools/tests/test_svn.py", line 154, in parse_tester
data = _read_utf8_file(path)
File "/tmp/tmpL7HWiJ/src/10168/.tox/py27/lib/python2.7/site-packages/setuptools/tests/test_svn.py", line 56, in _read_utf8_file
fileobj = io.open(path, 'r', encoding='utf-8')
IOError: [Errno 2] No such file or directory: 'setuptools/tests/svn_data/svn14_ext_list.txt'

no stdout
no stderr
======================================================================
ERROR: test_svn15 (test_svn.ParseExternal)
----------------------------------------------------------------------
Traceback (most recent call last)
File "/usr/lib/python2.7/unittest/case.py", line 329, in run
testMethod()
File "/tmp/tmpL7HWiJ/src/10168/.tox/py27/lib/python2.7/site-packages/setuptools/tests/test_svn.py", line 172, in test_svn15
self.parse_tester('svn15', False)
File "/tmp/tmpL7HWiJ/src/10168/.tox/py27/lib/python2.7/site-packages/setuptools/tests/test_svn.py", line 154, in parse_tester
data = _read_utf8_file(path)
File "/tmp/tmpL7HWiJ/src/10168/.tox/py27/lib/python2.7/site-packages/setuptools/tests/test_svn.py", line 56, in _read_utf8_file
fileobj = io.open(path, 'r', encoding='utf-8')
IOError: [Errno 2] No such file or directory: 'setuptools/tests/svn_data/svn15_ext_list.txt'

no stdout
no stderr
======================================================================
ERROR: test_svn16 (test_svn.ParseExternal)
----------------------------------------------------------------------
Traceback (most recent call last)
File "/usr/lib/python2.7/unittest/case.py", line 329, in run
testMethod()
File "/tmp/tmpL7HWiJ/src/10168/.tox/py27/lib/python2.7/site-packages/setuptools/tests/test_svn.py", line 175, in test_svn16
self.parse_tester('svn16', True)
File "/tmp/tmpL7HWiJ/src/10168/.tox/py27/lib/python2.7/site-packages/setuptools/tests/test_svn.py", line 154, in parse_tester
data = _read_utf8_file(path)
File "/tmp/tmpL7HWiJ/src/10168/.tox/py27/lib/python2.7/site-packages/setuptools/tests/test_svn.py", line 56, in _read_utf8_file
fileobj = io.open(path, 'r', encoding='utf-8')
IOError: [Errno 2] No such file or directory: 'setuptools/tests/svn_data/svn16_ext_list.txt'

no stdout
no stderr
======================================================================
ERROR: test_svn17 (test_svn.ParseExternal)
----------------------------------------------------------------------
Traceback (most recent call last)
File "/usr/lib/python2.7/unittest/case.py", line 329, in run
testMethod()
File "/tmp/tmpL7HWiJ/src/10168/.tox/py27/lib/python2.7/site-packages/setuptools/tests/test_svn.py", line 178, in test_svn17
self.parse_tester('svn17', True)
File "/tmp/tmpL7HWiJ/src/10168/.tox/py27/lib/python2.7/site-packages/setuptools/tests/test_svn.py", line 154, in parse_tester
data = _read_utf8_file(path)
File "/tmp/tmpL7HWiJ/src/10168/.tox/py27/lib/python2.7/site-packages/setuptools/tests/test_svn.py", line 56, in _read_utf8_file
fileobj = io.open(path, 'r', encoding='utf-8')
IOError: [Errno 2] No such file or directory: 'setuptools/tests/svn_data/svn17_ext_list.txt'

no stdout
no stderr
======================================================================
ERROR: test_svn18 (test_svn.ParseExternal)
----------------------------------------------------------------------
Traceback (most recent call last)
File "/usr/lib/python2.7/unittest/case.py", line 329, in run
testMethod()
File "/tmp/tmpL7HWiJ/src/10168/.tox/py27/lib/python2.7/site-packages/setuptools/tests/test_svn.py", line 181, in test_svn18
self.parse_tester('svn18', True)
File "/tmp/tmpL7HWiJ/src/10168/.tox/py27/lib/python2.7/site-packages/setuptools/tests/test_svn.py", line 154, in parse_tester
data = _read_utf8_file(path)
File "/tmp/tmpL7HWiJ/src/10168/.tox/py27/lib/python2.7/site-packages/setuptools/tests/test_svn.py", line 56, in _read_utf8_file
fileobj = io.open(path, 'r', encoding='utf-8')
IOError: [Errno 2] No such file or directory: 'setuptools/tests/svn_data/svn18_ext_list.txt'

no stdout
no stderr
======================================================================
ERROR: test_svn15 (test_svn.ParserExternalXML)
----------------------------------------------------------------------
Traceback (most recent call last)
File "/usr/lib/python2.7/unittest/case.py", line 329, in run
testMethod()
File "/tmp/tmpL7HWiJ/src/10168/.tox/py27/lib/python2.7/site-packages/setuptools/tests/test_svn.py", line 137, in test_svn15
self.parse_tester('svn15', False)
File "/tmp/tmpL7HWiJ/src/10168/.tox/py27/lib/python2.7/site-packages/setuptools/tests/test_svn.py", line 108, in parse_tester
data = _read_utf8_file(path)
File "/tmp/tmpL7HWiJ/src/10168/.tox/py27/lib/python2.7/site-packages/setuptools/tests/test_svn.py", line 56, in _read_utf8_file
fileobj = io.open(path, 'r', encoding='utf-8')
IOError: [Errno 2] No such file or directory: 'setuptools/tests/svn_data/svn15_ext_list.xml'

no stdout
no stderr
======================================================================
ERROR: test_svn16 (test_svn.ParserExternalXML)
----------------------------------------------------------------------
Traceback (most recent call last)
File "/usr/lib/python2.7/unittest/case.py", line 329, in run
testMethod()
File "/tmp/tmpL7HWiJ/src/10168/.tox/py27/lib/python2.7/site-packages/setuptools/tests/test_svn.py", line 140, in test_svn16
self.parse_tester('svn16', True)
File "/tmp/tmpL7HWiJ/src/10168/.tox/py27/lib/python2.7/site-packages/setuptools/tests/test_svn.py", line 108, in parse_tester
data = _read_utf8_file(path)
File "/tmp/tmpL7HWiJ/src/10168/.tox/py27/lib/python2.7/site-packages/setuptools/tests/test_svn.py", line 56, in _read_utf8_file
fileobj = io.open(path, 'r', encoding='utf-8')
IOError: [Errno 2] No such file or directory: 'setuptools/tests/svn_data/svn16_ext_list.xml'

no stdout
no stderr
======================================================================
ERROR: test_svn17 (test_svn.ParserExternalXML)
----------------------------------------------------------------------
Traceback (most recent call last)
File "/usr/lib/python2.7/unittest/case.py", line 329, in run
testMethod()
File "/tmp/tmpL7HWiJ/src/10168/.tox/py27/lib/python2.7/site-packages/setuptools/tests/test_svn.py", line 143, in test_svn17
self.parse_tester('svn17', True)
File "/tmp/tmpL7HWiJ/src/10168/.tox/py27/lib/python2.7/site-packages/setuptools/tests/test_svn.py", line 108, in parse_tester
data = _read_utf8_file(path)
File "/tmp/tmpL7HWiJ/src/10168/.tox/py27/lib/python2.7/site-packages/setuptools/tests/test_svn.py", line 56, in _read_utf8_file
fileobj = io.open(path, 'r', encoding='utf-8')
IOError: [Errno 2] No such file or directory: 'setuptools/tests/svn_data/svn17_ext_list.xml'

no stdout
no stderr
======================================================================
ERROR: test_svn18 (test_svn.ParserExternalXML)
----------------------------------------------------------------------
Traceback (most recent call last)
File "/usr/lib/python2.7/unittest/case.py", line 329, in run
testMethod()
File "/tmp/tmpL7HWiJ/src/10168/.tox/py27/lib/python2.7/site-packages/setuptools/tests/test_svn.py", line 146, in test_svn18
self.parse_tester('svn18', True)
File "/tmp/tmpL7HWiJ/src/10168/.tox/py27/lib/python2.7/site-packages/setuptools/tests/test_svn.py", line 108, in parse_tester
data = _read_utf8_file(path)
File "/tmp/tmpL7HWiJ/src/10168/.tox/py27/lib/python2.7/site-packages/setuptools/tests/test_svn.py", line 56, in _read_utf8_file
fileobj = io.open(path, 'r', encoding='utf-8')
IOError: [Errno 2] No such file or directory: 'setuptools/tests/svn_data/svn18_ext_list.xml'

no stdout
no stderr
======================================================================
ERROR: test_svn13 (test_svn.ParserInfoXML)
----------------------------------------------------------------------
Traceback (most recent call last)
File "/usr/lib/python2.7/unittest/case.py", line 329, in run
testMethod()
File "/tmp/tmpL7HWiJ/src/10168/.tox/py27/lib/python2.7/site-packages/setuptools/tests/test_svn.py", line 85, in test_svn13
self.parse_tester('svn13', False)
File "/tmp/tmpL7HWiJ/src/10168/.tox/py27/lib/python2.7/site-packages/setuptools/tests/test_svn.py", line 73, in parse_tester
data = _read_utf8_file(path)
File "/tmp/tmpL7HWiJ/src/10168/.tox/py27/lib/python2.7/site-packages/setuptools/tests/test_svn.py", line 56, in _read_utf8_file
fileobj = io.open(path, 'r', encoding='utf-8')
IOError: [Errno 2] No such file or directory: 'setuptools/tests/svn_data/svn13_info.xml'

no stdout
no stderr
======================================================================
ERROR: test_svn14 (test_svn.ParserInfoXML)
----------------------------------------------------------------------
Traceback (most recent call last)
File "/usr/lib/python2.7/unittest/case.py", line 329, in run
testMethod()
File "/tmp/tmpL7HWiJ/src/10168/.tox/py27/lib/python2.7/site-packages/setuptools/tests/test_svn.py", line 88, in test_svn14
self.parse_tester('svn14', False)
File "/tmp/tmpL7HWiJ/src/10168/.tox/py27/lib/python2.7/site-packages/setuptools/tests/test_svn.py", line 73, in parse_tester
data = _read_utf8_file(path)
File "/tmp/tmpL7HWiJ/src/10168/.tox/py27/lib/python2.7/site-packages/setuptools/tests/test_svn.py", line 56, in _read_utf8_file
fileobj = io.open(path, 'r', encoding='utf-8')
IOError: [Errno 2] No such file or directory: 'setuptools/tests/svn_data/svn14_info.xml'

no stdout
no stderr
======================================================================
ERROR: test_svn15 (test_svn.ParserInfoXML)
----------------------------------------------------------------------
Traceback (most recent call last)
File "/usr/lib/python2.7/unittest/case.py", line 329, in run
testMethod()
File "/tmp/tmpL7HWiJ/src/10168/.tox/py27/lib/python2.7/site-packages/setuptools/tests/test_svn.py", line 91, in test_svn15
self.parse_tester('svn15', False)
File "/tmp/tmpL7HWiJ/src/10168/.tox/py27/lib/python2.7/site-packages/setuptools/tests/test_svn.py", line 73, in parse_tester
data = _read_utf8_file(path)
File "/tmp/tmpL7HWiJ/src/10168/.tox/py27/lib/python2.7/site-packages/setuptools/tests/test_svn.py", line 56, in _read_utf8_file
fileobj = io.open(path, 'r', encoding='utf-8')
IOError: [Errno 2] No such file or directory: 'setuptools/tests/svn_data/svn15_info.xml'

no stdout
no stderr
======================================================================
ERROR: test_svn16 (test_svn.ParserInfoXML)
----------------------------------------------------------------------
Traceback (most recent call last)
File "/usr/lib/python2.7/unittest/case.py", line 329, in run
testMethod()
File "/tmp/tmpL7HWiJ/src/10168/.tox/py27/lib/python2.7/site-packages/setuptools/tests/test_svn.py", line 94, in test_svn16
self.parse_tester('svn16', True)
File "/tmp/tmpL7HWiJ/src/10168/.tox/py27/lib/python2.7/site-packages/setuptools/tests/test_svn.py", line 73, in parse_tester
data = _read_utf8_file(path)
File "/tmp/tmpL7HWiJ/src/10168/.tox/py27/lib/python2.7/site-packages/setuptools/tests/test_svn.py", line 56, in _read_utf8_file
fileobj = io.open(path, 'r', encoding='utf-8')
IOError: [Errno 2] No such file or directory: 'setuptools/tests/svn_data/svn16_info.xml'

no stdout
no stderr
======================================================================
ERROR: test_svn17 (test_svn.ParserInfoXML)
----------------------------------------------------------------------
Traceback (most recent call last)
File "/usr/lib/python2.7/unittest/case.py", line 329, in run
testMethod()
File "/tmp/tmpL7HWiJ/src/10168/.tox/py27/lib/python2.7/site-packages/setuptools/tests/test_svn.py", line 97, in test_svn17
self.parse_tester('svn17', True)
File "/tmp/tmpL7HWiJ/src/10168/.tox/py27/lib/python2.7/site-packages/setuptools/tests/test_svn.py", line 73, in parse_tester
data = _read_utf8_file(path)
File "/tmp/tmpL7HWiJ/src/10168/.tox/py27/lib/python2.7/site-packages/setuptools/tests/test_svn.py", line 56, in _read_utf8_file
fileobj = io.open(path, 'r', encoding='utf-8')
IOError: [Errno 2] No such file or directory: 'setuptools/tests/svn_data/svn17_info.xml'

no stdout
no stderr
======================================================================
ERROR: test_svn18 (test_svn.ParserInfoXML)
----------------------------------------------------------------------
Traceback (most recent call last)
File "/usr/lib/python2.7/unittest/case.py", line 329, in run
testMethod()
File "/tmp/tmpL7HWiJ/src/10168/.tox/py27/lib/python2.7/site-packages/setuptools/tests/test_svn.py", line 100, in test_svn18
self.parse_tester('svn18', True)
File "/tmp/tmpL7HWiJ/src/10168/.tox/py27/lib/python2.7/site-packages/setuptools/tests/test_svn.py", line 73, in parse_tester
data = _read_utf8_file(path)
File "/tmp/tmpL7HWiJ/src/10168/.tox/py27/lib/python2.7/site-packages/setuptools/tests/test_svn.py", line 56, in _read_utf8_file
fileobj = io.open(path, 'r', encoding='utf-8')
IOError: [Errno 2] No such file or directory: 'setuptools/tests/svn_data/svn18_info.xml'

no stdout
no stderr
======================================================================
FAIL: test_entries (test_svn.TestSvn)
----------------------------------------------------------------------
Traceback (most recent call last)
File "/usr/lib/python2.7/unittest/case.py", line 329, in run
testMethod()
File "/tmp/tmpL7HWiJ/src/10168/.tox/py27/lib/python2.7/site-packages/setuptools/tests/test_svn.py", line 222, in test_entries
self.assertEqual(set(x for x in info.entries), expected)
File "/usr/lib/python2.7/unittest/case.py", line 513, in assertEqual
assertion_func(first, second, msg=msg)
File "/usr/lib/python2.7/unittest/case.py", line 796, in assertSetEqual
self.fail(self._formatMessage(msg, standardMsg))
File "/usr/lib/python2.7/unittest/case.py", line 410, in fail
raise self.failureException(msg)
AssertionError: Items in the second set but not the first:
('a file', 'file')
('folder/lalala.txt', 'file')
('folder/quest.txt', 'file')
('folder', 'dir')

no stdout
no stderr
======================================================================
FAIL: test_externals (test_svn.TestSvn)
----------------------------------------------------------------------
Traceback (most recent call last)
File "/usr/lib/python2.7/unittest/case.py", line 329, in run
testMethod()
File "/tmp/tmpL7HWiJ/src/10168/.tox/py27/lib/python2.7/site-packages/setuptools/tests/test_svn.py", line 242, in test_externals
self.assertEqual(set([x for x in info.externals]), expected)
File "/usr/lib/python2.7/unittest/case.py", line 513, in assertEqual
assertion_func(first, second, msg=msg)
File "/usr/lib/python2.7/unittest/case.py", line 796, in assertSetEqual
self.fail(self._formatMessage(msg, standardMsg))
File "/usr/lib/python2.7/unittest/case.py", line 410, in fail
raise self.failureException(msg)
AssertionError: Items in the second set but not the first:
'third_party'
'third party2'
'third party3'
'folder/third_party'
'folder/third party2'
'folder/third party3'

no stdout
no stderr
======================================================================
FAIL: test_revision (test_svn.TestSvn)
----------------------------------------------------------------------
Traceback (most recent call last)
File "/usr/lib/python2.7/unittest/case.py", line 329, in run
testMethod()
File "/tmp/tmpL7HWiJ/src/10168/.tox/py27/lib/python2.7/site-packages/setuptools/tests/test_svn.py", line 209, in test_revision
self.assertEqual(rev, 6)
File "/usr/lib/python2.7/unittest/case.py", line 513, in assertEqual
assertion_func(first, second, msg=msg)
File "/usr/lib/python2.7/unittest/case.py", line 506, in _baseAssertEqual
raise self.failureException(msg)
AssertionError: 0 != 6

no stdout
no stderr
========================= test_egg_info.py =========================
svn, version 1.8.10 (r1615264)
compiled Apr 1 2015, 02:54:56 on x86_64-pc-linux-gnu

Copyright (C) 2014 The Apache Software Foundation.
This software consists of contributions made by many people;
see the NOTICE file for more information.
Subversion is open source software, see http://subversion.apache.org/

The following repository access (RA) modules are available:

* ra_svn : Module for accessing a repository using the svn network protocol.
- with Cyrus SASL authentication
- handles 'svn' scheme
* ra_local : Module for accessing a repository on local disk.
- handles 'file' scheme
* ra_serf : Module for accessing a repository via WebDAV protocol using serf.
- using serf 1.3.8
- handles 'http' scheme
- handles 'https' scheme

unhandled exception occurred while testing test_egg_info
Traceback (most recent call last):
File "/tmp/tmpL7HWiJ/src/10168/.tox/py27/local/lib/python2.7/site-packages/logilab/common/pytest.py", line 440, in testfile
options=self.options, outstream=sys.stderr)
File "/tmp/tmpL7HWiJ/src/10168/.tox/py27/local/lib/python2.7/site-packages/logilab/common/pytest.py", line 756, in __init__
testLoader=NonStrictTestLoader())
File "/usr/lib/python2.7/unittest/main.py", line 77, in __init__
self.module = __import__(module)
File "test_egg_info.py", line 15, in <module>
ENTRIES_V10 = pkg_resources.resource_string(__name__, 'entries-v10')
File "/tmp/tmpL7HWiJ/src/10168/.tox/py27/local/lib/python2.7/site-packages/pkg_resources.py", line 966, in resource_string
self, resource_name
File "/tmp/tmpL7HWiJ/src/10168/.tox/py27/local/lib/python2.7/site-packages/pkg_resources.py", line 1393, in get_resource_string
return self._get(self._fn(self.module_path, resource_name))
File "/tmp/tmpL7HWiJ/src/10168/.tox/py27/local/lib/python2.7/site-packages/pkg_resources.py", line 1514, in _get
with open(path, 'rb') as stream:
IOError: [Errno 2] No such file or directory: 'entries-v10'
======================= test_packageindex.py =======================
...........going into /tmp/tmpL7HWiJ/src/10168/.tox/py27/lib/python2.7/site-packages/setuptools/tests
Reading http://127.0.0.1:56754/setuptools/tests/indexes/test_links_priority/simple/foobar/
127.0.0.1 - - [29/Jun/2015 11:50:06] code 404, message File not found
127.0.0.1 - - [29/Jun/2015 11:50:06] "GET /setuptools/tests/indexes/test_links_priority/simple/foobar/ HTTP/1.1" 404 -
Couldn't find index page for 'foobar' (maybe misspelled?)
Scanning index of all packages (this may take a while)
Reading http://127.0.0.1:56754/setuptools/tests/indexes/test_links_priority/simple/
127.0.0.1 - - [29/Jun/2015 11:50:06] code 404, message File not found
127.0.0.1 - - [29/Jun/2015 11:50:06] "GET /setuptools/tests/indexes/test_links_priority/simple/ HTTP/1.1" 404 -
127.0.0.1 - - [29/Jun/2015 11:50:06] "GET / HTTP/1.1" 200 -
F...
======================================================================
FAIL: test_links_priority (test_packageindex.TestPackageIndex)
----------------------------------------------------------------------
Traceback (most recent call last)
File "/usr/lib/python2.7/unittest/case.py", line 329, in run
testMethod()
File "/tmp/tmpL7HWiJ/src/10168/.tox/py27/lib/python2.7/site-packages/setuptools/tests/test_packageindex.py", line 130, in test_links_priority
self.assertTrue('foobar' in pi)
File "/usr/lib/python2.7/unittest/case.py", line 422, in assertTrue
raise self.failureException(msg)
AssertionError: False is not true

no stdout
no stderr
======================= test_easy_install.py =======================
unhandled exception occurred while testing test_easy_install
Traceback (most recent call last):
File "/tmp/tmpL7HWiJ/src/10168/.tox/py27/local/lib/python2.7/site-packages/logilab/common/pytest.py", line 440, in testfile
options=self.options, outstream=sys.stderr)
File "/tmp/tmpL7HWiJ/src/10168/.tox/py27/local/lib/python2.7/site-packages/logilab/common/pytest.py", line 756, in __init__
testLoader=NonStrictTestLoader())
File "/usr/lib/python2.7/unittest/main.py", line 77, in __init__
self.module = __import__(module)
File "test_easy_install.py", line 26, in <module>
from .py26compat import skipIf
ValueError: Attempted relative import in non-package
======================== test_build_ext.py =========================
.
========================= test_sandbox.py ==========================
...
======================== test_dist_info.py =========================
..
========================== test_sdist.py ===========================
F.....F
======================================================================
FAIL: test_sources (test_sdist.TestDummyOutput)
----------------------------------------------------------------------
Traceback (most recent call last)
File "/usr/lib/python2.7/unittest/case.py", line 329, in run
testMethod()
File "/tmp/tmpL7HWiJ/src/10168/.tox/py27/lib/python2.7/site-packages/setuptools/tests/test_sdist.py", line 459, in test_sources
self._run()
File "/tmp/tmpL7HWiJ/src/10168/.tox/py27/lib/python2.7/site-packages/setuptools/tests/test_sdist.py", line 409, in _run
raise AssertionError(info)
AssertionError: DIR: /tmp/tmpL7HWiJ/src/10168/.tox/py27/lib/python2.7/site-packages/setuptools/tests
SDIST RETURNED: 2

no stdout
no stderr
======================================================================
FAIL: test_walksvn (test_sdist.TestSvn)
----------------------------------------------------------------------
Traceback (most recent call last)
File "/usr/lib/python2.7/unittest/case.py", line 329, in run
testMethod()
File "/tmp/tmpL7HWiJ/src/10168/.tox/py27/lib/python2.7/site-packages/setuptools/tests/test_sdist.py", line 520, in test_walksvn
self.assertEqual(set(x for x in walk_revctrl()), expected)
File "/usr/lib/python2.7/unittest/case.py", line 513, in assertEqual
assertion_func(first, second, msg=msg)
File "/usr/lib/python2.7/unittest/case.py", line 796, in assertSetEqual
self.fail(self._formatMessage(msg, standardMsg))
File "/usr/lib/python2.7/unittest/case.py", line 410, in fail
raise self.failureException(msg)
AssertionError: Items in the second set but not the first:
'third party3/MD5SUMS'
'third party3/fin'
'folder/third party3/oops'
'third party3/TODO.txt'
'folder/third party3/fin'
'folder/third party2/Changes.txt'
'third party2/MD5SUMS'
'third party2/README.txt'
'folder/third party3/MD5SUMS'
'folder/third party3/Changes.txt'
'third_party/README.txt'
'folder/third party2/MD5SUMS'
'a file'
'third party3/Changes.txt'
'folder/third party2/WatashiNiYomimasu.txt'
'folder/third party3/WatashiNiYomimasu.txt'
'third party2/Changes.txt'
'folder/lalala.txt'
'folder/third party3/ZuMachen.txt'
'third party3/README.txt'
'folder/third_party/WatashiNiYomimasu.txt'
'folder/quest.txt'

no stdout
no stderr
=========================== test_test.py ===========================
.
======================= unittest_testlib.py ========================
.............................................................................unittest_testlib.py:153: DeprecationWarning: Non-standard: please copy test method to your TestCase class
self.assertDirEqual(ed1, ed2)
unittest_testlib.py:154: DeprecationWarning: Non-standard: please copy test method to your TestCase class
self.assertDirEqual(ref, ref)
/tmp/tmpL7HWiJ/src/10168/.tox/py27/local/lib/python2.7/site-packages/logilab/common/testlib.py:1004: DeprecationWarning: Non-standard: please copy test method to your TestCase class
osp.join(path_b, ipath_b, ifiles_b[index]))
/tmp/tmpL7HWiJ/src/10168/.tox/py27/local/lib/python2.7/site-packages/logilab/common/testlib.py:943: DeprecationWarning: Non-standard: please copy test method to your TestCase class
msg_prefix='Files differs\n-:%s\n+:%s\n'%(fname1, fname2))
unittest_testlib.py:155: DeprecationWarning: Non-standard: please copy test method to your TestCase class
self.assertDirEqual( ref, same)
/tmp/tmpL7HWiJ/src/10168/.tox/py27/local/lib/python2.7/site-packages/logilab/common/testlib.py:1095: DeprecationWarning: Non-standard: please copy test method to your TestCase class
callableObj(*args, **kwargs)
..unittest_testlib.py:139: DeprecationWarning: Non-standard: please copy test method to your TestCase class
self.tc.assertFileEqual(foo, foo)
.........unittest_testlib.py:166: DeprecationWarning: Non-standard: please copy test method to your TestCase class
self.tc.assertStreamEqual(stream1, stream1)
..unittest_testlib.py:123: DeprecationWarning: Non-standard: please copy test method to your TestCase class
self.tc.assertXMLStringWellFormed(valid)
...
====================== unittest_interface.py =======================
.....
========================= unittest_tree.py =========================
........................
===================== unittest_deprecation.py ======================
.......
==================== unittest_configuration.py =====================
.................
====================== unittest_fileutils.py =======================
............
====================== unittest_textutils.py =======================
.........................................
======================= unittest_xmlutils.py =======================
.....
====================== unittest_changelog.py =======================
.
====================== unittest_decorators.py ======================
.............
======================= unittest_umessage.py =======================
....
======================== unittest_table.py =========================
.....................................
======================== unittest_graph.py =========================
..............
====================== unittest_shellutils.py ======================
.......................
======================== unittest_cache.py =========================
........
====================== unittest_taskqueue.py =======================
.....
==================== unittest_ureports_html.py =====================
.......
========================= unittest_date.py =========================
unhandled exception occurred while testing unittest_date
Traceback (most recent call last):
File "/tmp/tmpL7HWiJ/src/10168/.tox/py27/local/lib/python2.7/site-packages/logilab/common/pytest.py", line 440, in testfile
options=self.options, outstream=sys.stderr)
File "/tmp/tmpL7HWiJ/src/10168/.tox/py27/local/lib/python2.7/site-packages/logilab/common/pytest.py", line 756, in __init__
testLoader=NonStrictTestLoader())
File "/usr/lib/python2.7/unittest/main.py", line 77, in __init__
self.module = __import__(module)
File "unittest_date.py", line 28, in <module>
import pytz
ImportError: No module named pytz
======================== unittest_pytest.py ========================
unittest_pytest.py:89: DeprecationWarning: [lgc 0.63.1] Use the pause_trace() context manager
pause_tracing()
unittest_pytest.py:92: DeprecationWarning: [lgc 0.63.1] Use the pause_trace() context manager
pause_tracing()
unittest_pytest.py:94: DeprecationWarning: [lgc 0.63.1] Use the pause_trace() context manager
resume_tracing()
unittest_pytest.py:97: DeprecationWarning: [lgc 0.63.1] Use the pause_trace() context manager
resume_tracing()
......
======================= unittest_registry.py =======================
............
==================== unittest_ureports_text.py =====================
.......
======================= unittest_modutils.py =======================
....................................
going into /tmp/tmpL7HWiJ/src/10168/test
*******************************************************************************
Ran 447 test cases in 11.95s (0.47s CPU), 21 errors, 6 failures
30 modules OK (8 failed)
failures: /tmp/tmpL7HWiJ/src/10168/.tox/py27/lib/python2.7/site-packages/setuptools/tests/test_integration [1/1], /tmp/tmpL7HWiJ/src/10168/.tox/py27/lib/python2.7/site-packages/setuptools/tests/test_resources [1/1], /tmp/tmpL7HWiJ/src/10168/.tox/py27/lib/python2.7/site-packages/setuptools/tests/test_svn [19/21], /tmp/tmpL7HWiJ/src/10168/.tox/py27/lib/python2.7/site-packages/setuptools/tests/test_egg_info [1/1], /tmp/tmpL7HWiJ/src/10168/.tox/py27/lib/python2.7/site-packages/setuptools/tests/test_packageindex [1/15], /tmp/tmpL7HWiJ/src/10168/.tox/py27/lib/python2.7/site-packages/setuptools/tests/test_easy_install [1/1], /tmp/tmpL7HWiJ/src/10168/.tox/py27/lib/python2.7/site-packages/setuptools/tests/test_sdist [2/7], /tmp/tmpL7HWiJ/src/10168/test/unittest_date [1/1]
ERROR: InvocationError: '/tmp/tmpL7HWiJ/src/10168/.tox/py27/bin/pytest'
py34 create: /tmp/tmpL7HWiJ/src/10168/.tox/py34
py34 inst: /tmp/tmpL7HWiJ/src/10168/.tox/dist/logilab-common-1.0.0.zip
py34 runtests: PYTHONHASHSEED='3961173614'
py34 runtests: commands[0] | pytest
========================= test_develop.py ==========================
.
======================= test_integration.py ========================
unhandled exception occurred while testing test_integration
Traceback (most recent call last):
File "/tmp/tmpL7HWiJ/src/10168/.tox/py34/lib/python3.4/site-packages/logilab/common/pytest.py", line 440, in testfile
options=self.options, outstream=sys.stderr)
File "/tmp/tmpL7HWiJ/src/10168/.tox/py34/lib/python3.4/site-packages/logilab/common/pytest.py", line 756, in __init__
testLoader=NonStrictTestLoader())
File "/usr/lib/python3.4/unittest/main.py", line 63, in __init__
self.module = __import__(module)
File "/tmp/tmpL7HWiJ/src/10168/.tox/py27/lib/python2.7/site-packages/setuptools/tests/test_integration.py", line 10, in <module>
import pytest
ImportError: No module named 'pytest'
======================= test_upload_docs.py ========================
.
====================== test_find_packages.py =======================
...........
======================== test_markerlib.py =========================
.
======================== test_bdist_egg.py =========================
/tmp/tmpL7HWiJ/src/10168/.tox/py34/lib/python3.4/site-packages/setuptools/command/sdist.py:236: DeprecationWarning: 'U' mode is deprecated
manifest = open(self.manifest, 'rbU')
zip_safe flag not set; analyzing archive contents...
.svn, version 1.8.10 (r1615264)
compiled Apr 1 2015, 02:54:56 on x86_64-pc-linux-gnu

Copyright (C) 2014 The Apache Software Foundation.
This software consists of contributions made by many people;
see the NOTICE file for more information.
Subversion is open source software, see http://subversion.apache.org/

The following repository access (RA) modules are available:

* ra_svn : Module for accessing a repository using the svn network protocol.
- with Cyrus SASL authentication
- handles 'svn' scheme
* ra_local : Module for accessing a repository on local disk.
- handles 'file' scheme
* ra_serf : Module for accessing a repository via WebDAV protocol using serf.
- using serf 1.3.8
- handles 'http' scheme
- handles 'https' scheme

======================== test_resources.py =========================
unhandled exception occurred while testing test_resources
Traceback (most recent call last):
File "/tmp/tmpL7HWiJ/src/10168/.tox/py34/lib/python3.4/site-packages/logilab/common/pytest.py", line 440, in testfile
options=self.options, outstream=sys.stderr)
File "/tmp/tmpL7HWiJ/src/10168/.tox/py34/lib/python3.4/site-packages/logilab/common/pytest.py", line 756, in __init__
testLoader=NonStrictTestLoader())
File "/usr/lib/python3.4/unittest/main.py", line 63, in __init__
self.module = __import__(module)
File "/tmp/tmpL7HWiJ/src/10168/.tox/py27/lib/python2.7/site-packages/setuptools/tests/test_resources.py", line 19, in <module>
from .py26compat import skipIf
SystemError: Parent module '' not loaded, cannot perform relative import
=========================== test_svn.py ============================
EEEEEEEEEEEEEEEEFFF..
======================================================================
ERROR: test_svn13 (test_svn.ParseExternal)
----------------------------------------------------------------------
Traceback (most recent call last)
File "/usr/lib/python3.4/unittest/case.py", line 58, in testPartExecutor
yield
File "/usr/lib/python3.4/unittest/case.py", line 577, in run
testMethod()
File "/tmp/tmpL7HWiJ/src/10168/.tox/py27/lib/python2.7/site-packages/setuptools/tests/test_svn.py", line 166, in test_svn13
self.parse_tester('svn13', False)
File "/tmp/tmpL7HWiJ/src/10168/.tox/py27/lib/python2.7/site-packages/setuptools/tests/test_svn.py", line 154, in parse_tester
data = _read_utf8_file(path)
File "/tmp/tmpL7HWiJ/src/10168/.tox/py27/lib/python2.7/site-packages/setuptools/tests/test_svn.py", line 56, in _read_utf8_file
fileobj = io.open(path, 'r', encoding='utf-8')
FileNotFoundError: [Errno 2] No such file or directory: 'setuptools/tests/svn_data/svn13_ext_list.txt'

no stdout
no stderr
======================================================================
ERROR: test_svn14 (test_svn.ParseExternal)
----------------------------------------------------------------------
Traceback (most recent call last)
File "/usr/lib/python3.4/unittest/case.py", line 58, in testPartExecutor
yield
File "/usr/lib/python3.4/unittest/case.py", line 577, in run
testMethod()
File "/tmp/tmpL7HWiJ/src/10168/.tox/py27/lib/python2.7/site-packages/setuptools/tests/test_svn.py", line 169, in test_svn14
self.parse_tester('svn14', False)
File "/tmp/tmpL7HWiJ/src/10168/.tox/py27/lib/python2.7/site-packages/setuptools/tests/test_svn.py", line 154, in parse_tester
data = _read_utf8_file(path)
File "/tmp/tmpL7HWiJ/src/10168/.tox/py27/lib/python2.7/site-packages/setuptools/tests/test_svn.py", line 56, in _read_utf8_file
fileobj = io.open(path, 'r', encoding='utf-8')
FileNotFoundError: [Errno 2] No such file or directory: 'setuptools/tests/svn_data/svn14_ext_list.txt'

no stdout
no stderr
======================================================================
ERROR: test_svn15 (test_svn.ParseExternal)
----------------------------------------------------------------------
Traceback (most recent call last)
File "/usr/lib/python3.4/unittest/case.py", line 58, in testPartExecutor
yield
File "/usr/lib/python3.4/unittest/case.py", line 577, in run
testMethod()
File "/tmp/tmpL7HWiJ/src/10168/.tox/py27/lib/python2.7/site-packages/setuptools/tests/test_svn.py", line 172, in test_svn15
self.parse_tester('svn15', False)
File "/tmp/tmpL7HWiJ/src/10168/.tox/py27/lib/python2.7/site-packages/setuptools/tests/test_svn.py", line 154, in parse_tester
data = _read_utf8_file(path)
File "/tmp/tmpL7HWiJ/src/10168/.tox/py27/lib/python2.7/site-packages/setuptools/tests/test_svn.py", line 56, in _read_utf8_file
fileobj = io.open(path, 'r', encoding='utf-8')
FileNotFoundError: [Errno 2] No such file or directory: 'setuptools/tests/svn_data/svn15_ext_list.txt'

no stdout
no stderr
======================================================================
ERROR: test_svn16 (test_svn.ParseExternal)
----------------------------------------------------------------------
Traceback (most recent call last)
File "/usr/lib/python3.4/unittest/case.py", line 58, in testPartExecutor
yield
File "/usr/lib/python3.4/unittest/case.py", line 577, in run
testMethod()
File "/tmp/tmpL7HWiJ/src/10168/.tox/py27/lib/python2.7/site-packages/setuptools/tests/test_svn.py", line 175, in test_svn16
self.parse_tester('svn16', True)
File "/tmp/tmpL7HWiJ/src/10168/.tox/py27/lib/python2.7/site-packages/setuptools/tests/test_svn.py", line 154, in parse_tester
data = _read_utf8_file(path)
File "/tmp/tmpL7HWiJ/src/10168/.tox/py27/lib/python2.7/site-packages/setuptools/tests/test_svn.py", line 56, in _read_utf8_file
fileobj = io.open(path, 'r', encoding='utf-8')
FileNotFoundError: [Errno 2] No such file or directory: 'setuptools/tests/svn_data/svn16_ext_list.txt'

no stdout
no stderr
======================================================================
ERROR: test_svn17 (test_svn.ParseExternal)
----------------------------------------------------------------------
Traceback (most recent call last)
File "/usr/lib/python3.4/unittest/case.py", line 58, in testPartExecutor
yield
File "/usr/lib/python3.4/unittest/case.py", line 577, in run
testMethod()
File "/tmp/tmpL7HWiJ/src/10168/.tox/py27/lib/python2.7/site-packages/setuptools/tests/test_svn.py", line 178, in test_svn17
self.parse_tester('svn17', True)
File "/tmp/tmpL7HWiJ/src/10168/.tox/py27/lib/python2.7/site-packages/setuptools/tests/test_svn.py", line 154, in parse_tester
data = _read_utf8_file(path)
File "/tmp/tmpL7HWiJ/src/10168/.tox/py27/lib/python2.7/site-packages/setuptools/tests/test_svn.py", line 56, in _read_utf8_file
fileobj = io.open(path, 'r', encoding='utf-8')
FileNotFoundError: [Errno 2] No such file or directory: 'setuptools/tests/svn_data/svn17_ext_list.txt'

no stdout
no stderr
======================================================================
ERROR: test_svn18 (test_svn.ParseExternal)
----------------------------------------------------------------------
Traceback (most recent call last)
File "/usr/lib/python3.4/unittest/case.py", line 58, in testPartExecutor
yield
File "/usr/lib/python3.4/unittest/case.py", line 577, in run
testMethod()
File "/tmp/tmpL7HWiJ/src/10168/.tox/py27/lib/python2.7/site-packages/setuptools/tests/test_svn.py", line 181, in test_svn18
self.parse_tester('svn18', True)
File "/tmp/tmpL7HWiJ/src/10168/.tox/py27/lib/python2.7/site-packages/setuptools/tests/test_svn.py", line 154, in parse_tester
data = _read_utf8_file(path)
File "/tmp/tmpL7HWiJ/src/10168/.tox/py27/lib/python2.7/site-packages/setuptools/tests/test_svn.py", line 56, in _read_utf8_file
fileobj = io.open(path, 'r', encoding='utf-8')
FileNotFoundError: [Errno 2] No such file or directory: 'setuptools/tests/svn_data/svn18_ext_list.txt'

no stdout
no stderr
======================================================================
ERROR: test_svn15 (test_svn.ParserExternalXML)
----------------------------------------------------------------------
Traceback (most recent call last)
File "/usr/lib/python3.4/unittest/case.py", line 58, in testPartExecutor
yield
File "/usr/lib/python3.4/unittest/case.py", line 577, in run
testMethod()
File "/tmp/tmpL7HWiJ/src/10168/.tox/py27/lib/python2.7/site-packages/setuptools/tests/test_svn.py", line 137, in test_svn15
self.parse_tester('svn15', False)
File "/tmp/tmpL7HWiJ/src/10168/.tox/py27/lib/python2.7/site-packages/setuptools/tests/test_svn.py", line 108, in parse_tester
data = _read_utf8_file(path)
File "/tmp/tmpL7HWiJ/src/10168/.tox/py27/lib/python2.7/site-packages/setuptools/tests/test_svn.py", line 56, in _read_utf8_file
fileobj = io.open(path, 'r', encoding='utf-8')
FileNotFoundError: [Errno 2] No such file or directory: 'setuptools/tests/svn_data/svn15_ext_list.xml'

no stdout
no stderr
======================================================================
ERROR: test_svn16 (test_svn.ParserExternalXML)
----------------------------------------------------------------------
Traceback (most recent call last)
File "/usr/lib/python3.4/unittest/case.py", line 58, in testPartExecutor
yield
File "/usr/lib/python3.4/unittest/case.py", line 577, in run
testMethod()
File "/tmp/tmpL7HWiJ/src/10168/.tox/py27/lib/python2.7/site-packages/setuptools/tests/test_svn.py", line 140, in test_svn16
self.parse_tester('svn16', True)
File "/tmp/tmpL7HWiJ/src/10168/.tox/py27/lib/python2.7/site-packages/setuptools/tests/test_svn.py", line 108, in parse_tester
data = _read_utf8_file(path)
File "/tmp/tmpL7HWiJ/src/10168/.tox/py27/lib/python2.7/site-packages/setuptools/tests/test_svn.py", line 56, in _read_utf8_file
fileobj = io.open(path, 'r', encoding='utf-8')
FileNotFoundError: [Errno 2] No such file or directory: 'setuptools/tests/svn_data/svn16_ext_list.xml'

no stdout
no stderr
======================================================================
ERROR: test_svn17 (test_svn.ParserExternalXML)
----------------------------------------------------------------------
Traceback (most recent call last)
File "/usr/lib/python3.4/unittest/case.py", line 58, in testPartExecutor
yield
File "/usr/lib/python3.4/unittest/case.py", line 577, in run
testMethod()
File "/tmp/tmpL7HWiJ/src/10168/.tox/py27/lib/python2.7/site-packages/setuptools/tests/test_svn.py", line 143, in test_svn17
self.parse_tester('svn17', True)
File "/tmp/tmpL7HWiJ/src/10168/.tox/py27/lib/python2.7/site-packages/setuptools/tests/test_svn.py", line 108, in parse_tester
data = _read_utf8_file(path)
File "/tmp/tmpL7HWiJ/src/10168/.tox/py27/lib/python2.7/site-packages/setuptools/tests/test_svn.py", line 56, in _read_utf8_file
fileobj = io.open(path, 'r', encoding='utf-8')
FileNotFoundError: [Errno 2] No such file or directory: 'setuptools/tests/svn_data/svn17_ext_list.xml'

no stdout
no stderr
======================================================================
ERROR: test_svn18 (test_svn.ParserExternalXML)
----------------------------------------------------------------------
Traceback (most recent call last)
File "/usr/lib/python3.4/unittest/case.py", line 58, in testPartExecutor
yield
File "/usr/lib/python3.4/unittest/case.py", line 577, in run
testMethod()
File "/tmp/tmpL7HWiJ/src/10168/.tox/py27/lib/python2.7/site-packages/setuptools/tests/test_svn.py", line 146, in test_svn18
self.parse_tester('svn18', True)
File "/tmp/tmpL7HWiJ/src/10168/.tox/py27/lib/python2.7/site-packages/setuptools/tests/test_svn.py", line 108, in parse_tester
data = _read_utf8_file(path)
File "/tmp/tmpL7HWiJ/src/10168/.tox/py27/lib/python2.7/site-packages/setuptools/tests/test_svn.py", line 56, in _read_utf8_file
fileobj = io.open(path, 'r', encoding='utf-8')
FileNotFoundError: [Errno 2] No such file or directory: 'setuptools/tests/svn_data/svn18_ext_list.xml'

no stdout
no stderr
======================================================================
ERROR: test_svn13 (test_svn.ParserInfoXML)
----------------------------------------------------------------------
Traceback (most recent call last)
File "/usr/lib/python3.4/unittest/case.py", line 58, in testPartExecutor
yield
File "/usr/lib/python3.4/unittest/case.py", line 577, in run
testMethod()
File "/tmp/tmpL7HWiJ/src/10168/.tox/py27/lib/python2.7/site-packages/setuptools/tests/test_svn.py", line 85, in test_svn13
self.parse_tester('svn13', False)
File "/tmp/tmpL7HWiJ/src/10168/.tox/py27/lib/python2.7/site-packages/setuptools/tests/test_svn.py", line 73, in parse_tester
data = _read_utf8_file(path)
File "/tmp/tmpL7HWiJ/src/10168/.tox/py27/lib/python2.7/site-packages/setuptools/tests/test_svn.py", line 56, in _read_utf8_file
fileobj = io.open(path, 'r', encoding='utf-8')
FileNotFoundError: [Errno 2] No such file or directory: 'setuptools/tests/svn_data/svn13_info.xml'

no stdout
no stderr
======================================================================
ERROR: test_svn14 (test_svn.ParserInfoXML)
----------------------------------------------------------------------
Traceback (most recent call last)
File "/usr/lib/python3.4/unittest/case.py", line 58, in testPartExecutor
yield
File "/usr/lib/python3.4/unittest/case.py", line 577, in run
testMethod()
File "/tmp/tmpL7HWiJ/src/10168/.tox/py27/lib/python2.7/site-packages/setuptools/tests/test_svn.py", line 88, in test_svn14
self.parse_tester('svn14', False)
File "/tmp/tmpL7HWiJ/src/10168/.tox/py27/lib/python2.7/site-packages/setuptools/tests/test_svn.py", line 73, in parse_tester
data = _read_utf8_file(path)
File "/tmp/tmpL7HWiJ/src/10168/.tox/py27/lib/python2.7/site-packages/setuptools/tests/test_svn.py", line 56, in _read_utf8_file
fileobj = io.open(path, 'r', encoding='utf-8')
FileNotFoundError: [Errno 2] No such file or directory: 'setuptools/tests/svn_data/svn14_info.xml'

no stdout
no stderr
======================================================================
ERROR: test_svn15 (test_svn.ParserInfoXML)
----------------------------------------------------------------------
Traceback (most recent call last)
File "/usr/lib/python3.4/unittest/case.py", line 58, in testPartExecutor
yield
File "/usr/lib/python3.4/unittest/case.py", line 577, in run
testMethod()
File "/tmp/tmpL7HWiJ/src/10168/.tox/py27/lib/python2.7/site-packages/setuptools/tests/test_svn.py", line 91, in test_svn15
self.parse_tester('svn15', False)
File "/tmp/tmpL7HWiJ/src/10168/.tox/py27/lib/python2.7/site-packages/setuptools/tests/test_svn.py", line 73, in parse_tester
data = _read_utf8_file(path)
File "/tmp/tmpL7HWiJ/src/10168/.tox/py27/lib/python2.7/site-packages/setuptools/tests/test_svn.py", line 56, in _read_utf8_file
fileobj = io.open(path, 'r', encoding='utf-8')
FileNotFoundError: [Errno 2] No such file or directory: 'setuptools/tests/svn_data/svn15_info.xml'

no stdout
no stderr
======================================================================
ERROR: test_svn16 (test_svn.ParserInfoXML)
----------------------------------------------------------------------
Traceback (most recent call last)
File "/usr/lib/python3.4/unittest/case.py", line 58, in testPartExecutor
yield
File "/usr/lib/python3.4/unittest/case.py", line 577, in run
testMethod()
File "/tmp/tmpL7HWiJ/src/10168/.tox/py27/lib/python2.7/site-packages/setuptools/tests/test_svn.py", line 94, in test_svn16
self.parse_tester('svn16', True)
File "/tmp/tmpL7HWiJ/src/10168/.tox/py27/lib/python2.7/site-packages/setuptools/tests/test_svn.py", line 73, in parse_tester
data = _read_utf8_file(path)
File "/tmp/tmpL7HWiJ/src/10168/.tox/py27/lib/python2.7/site-packages/setuptools/tests/test_svn.py", line 56, in _read_utf8_file
fileobj = io.open(path, 'r', encoding='utf-8')
FileNotFoundError: [Errno 2] No such file or directory: 'setuptools/tests/svn_data/svn16_info.xml'

no stdout
no stderr
======================================================================
ERROR: test_svn17 (test_svn.ParserInfoXML)
----------------------------------------------------------------------
Traceback (most recent call last)
File "/usr/lib/python3.4/unittest/case.py", line 58, in testPartExecutor
yield
File "/usr/lib/python3.4/unittest/case.py", line 577, in run
testMethod()
File "/tmp/tmpL7HWiJ/src/10168/.tox/py27/lib/python2.7/site-packages/setuptools/tests/test_svn.py", line 97, in test_svn17
self.parse_tester('svn17', True)
File "/tmp/tmpL7HWiJ/src/10168/.tox/py27/lib/python2.7/site-packages/setuptools/tests/test_svn.py", line 73, in parse_tester
data = _read_utf8_file(path)
File "/tmp/tmpL7HWiJ/src/10168/.tox/py27/lib/python2.7/site-packages/setuptools/tests/test_svn.py", line 56, in _read_utf8_file
fileobj = io.open(path, 'r', encoding='utf-8')
FileNotFoundError: [Errno 2] No such file or directory: 'setuptools/tests/svn_data/svn17_info.xml'

no stdout
no stderr
======================================================================
ERROR: test_svn18 (test_svn.ParserInfoXML)
----------------------------------------------------------------------svn, version 1.8.10 (r1615264)
compiled Apr 1 2015, 02:54:56 on x86_64-pc-linux-gnu

Copyright (C) 2014 The Apache Software Foundation.
This software consists of contributions made by many people;
see the NOTICE file for more information.
Subversion is open source software, see http://subversion.apache.org/

The following repository access (RA) modules are available:

* ra_svn : Module for accessing a repository using the svn network protocol.
- with Cyrus SASL authentication
- handles 'svn' scheme
* ra_local : Module for accessing a repository on local disk.
- handles 'file' scheme
* ra_serf : Module for accessing a repository via WebDAV protocol using serf.
- using serf 1.3.8
- handles 'http' scheme
- handles 'https' scheme

Traceback (most recent call last)
File "/usr/lib/python3.4/unittest/case.py", line 58, in testPartExecutor
yield
File "/usr/lib/python3.4/unittest/case.py", line 577, in run
testMethod()
File "/tmp/tmpL7HWiJ/src/10168/.tox/py27/lib/python2.7/site-packages/setuptools/tests/test_svn.py", line 100, in test_svn18
self.parse_tester('svn18', True)
File "/tmp/tmpL7HWiJ/src/10168/.tox/py27/lib/python2.7/site-packages/setuptools/tests/test_svn.py", line 73, in parse_tester
data = _read_utf8_file(path)
File "/tmp/tmpL7HWiJ/src/10168/.tox/py27/lib/python2.7/site-packages/setuptools/tests/test_svn.py", line 56, in _read_utf8_file
fileobj = io.open(path, 'r', encoding='utf-8')
FileNotFoundError: [Errno 2] No such file or directory: 'setuptools/tests/svn_data/svn18_info.xml'

no stdout
no stderr
======================================================================
FAIL: test_entries (test_svn.TestSvn)
----------------------------------------------------------------------
Traceback (most recent call last)
File "/usr/lib/python3.4/unittest/case.py", line 58, in testPartExecutor
yield
File "/usr/lib/python3.4/unittest/case.py", line 577, in run
testMethod()
File "/tmp/tmpL7HWiJ/src/10168/.tox/py27/lib/python2.7/site-packages/setuptools/tests/test_svn.py", line 222, in test_entries
self.assertEqual(set(x for x in info.entries), expected)
File "/usr/lib/python3.4/unittest/case.py", line 797, in assertEqual
assertion_func(first, second, msg=msg)
File "/usr/lib/python3.4/unittest/case.py", line 1049, in assertSetEqual
self.fail(self._formatMessage(msg, standardMsg))
File "/usr/lib/python3.4/unittest/case.py", line 642, in fail
raise self.failureException(msg)
AssertionError: Items in the second set but not the first:
('folder/lalala.txt', 'file')
('folder', 'dir')
('a file', 'file')
('folder/quest.txt', 'file')

no stdout
no stderr
======================================================================
FAIL: test_externals (test_svn.TestSvn)
----------------------------------------------------------------------
Traceback (most recent call last)
File "/usr/lib/python3.4/unittest/case.py", line 58, in testPartExecutor
yield
File "/usr/lib/python3.4/unittest/case.py", line 577, in run
testMethod()
File "/tmp/tmpL7HWiJ/src/10168/.tox/py27/lib/python2.7/site-packages/setuptools/tests/test_svn.py", line 242, in test_externals
self.assertEqual(set([x for x in info.externals]), expected)
File "/usr/lib/python3.4/unittest/case.py", line 797, in assertEqual
assertion_func(first, second, msg=msg)
File "/usr/lib/python3.4/unittest/case.py", line 1049, in assertSetEqual
self.fail(self._formatMessage(msg, standardMsg))
File "/usr/lib/python3.4/unittest/case.py", line 642, in fail
raise self.failureException(msg)
AssertionError: Items in the second set but not the first:
'folder/third_party'
'folder/third party3'
'folder/third party2'
'third_party'
'third party2'
'third party3'

no stdout
no stderr
======================================================================
FAIL: test_revision (test_svn.TestSvn)
----------------------------------------------------------------------
Traceback (most recent call last)
File "/usr/lib/python3.4/unittest/case.py", line 58, in testPartExecutor
yield
File "/usr/lib/python3.4/unittest/case.py", line 577, in run
testMethod()
File "/tmp/tmpL7HWiJ/src/10168/.tox/py27/lib/python2.7/site-packages/setuptools/tests/test_svn.py", line 209, in test_revision
self.assertEqual(rev, 6)
File "/usr/lib/python3.4/unittest/case.py", line 797, in assertEqual
assertion_func(first, second, msg=msg)
File "/usr/lib/python3.4/unittest/case.py", line 790, in _baseAssertEqual
raise self.failureException(msg)
AssertionError: 0 != 6

no stdout
no stderr
========================= test_egg_info.py =========================
unhandled exception occurred while testing test_egg_info
Traceback (most recent call last):
File "/tmp/tmpL7HWiJ/src/10168/.tox/py34/lib/python3.4/site-packages/logilab/common/pytest.py", line 440, in testfile
options=self.options, outstream=sys.stderr)
File "/tmp/tmpL7HWiJ/src/10168/.tox/py34/lib/python3.4/site-packages/logilab/common/pytest.py", line 756, in __init__
testLoader=NonStrictTestLoader())
File "/usr/lib/python3.4/unittest/main.py", line 63, in __init__
self.module = __import__(module)
File "/tmp/tmpL7HWiJ/src/10168/.tox/py27/lib/python2.7/site-packages/setuptools/tests/test_egg_info.py", line 15, in <module>
ENTRIES_V10 = pkg_resources.resource_string(__name__, 'entries-v10')
File "/tmp/tmpL7HWiJ/src/10168/.tox/py34/lib/python3.4/site-packages/pkg_resources.py", line 966, in resource_string
self, resource_name
File "/tmp/tmpL7HWiJ/src/10168/.tox/py34/lib/python3.4/site-packages/pkg_resources.py", line 1393, in get_resource_string
return self._get(self._fn(self.module_path, resource_name))
File "/tmp/tmpL7HWiJ/src/10168/.tox/py34/lib/python3.4/site-packages/pkg_resources.py", line 1514, in _get
with open(path, 'rb') as stream:
FileNotFoundError: [Errno 2] No such file or directory: '/tmp/tmpL7HWiJ/src/10168/.tox/py27/lib/python2.7/site-packages/setuptools/tests/entries-v10'
======================= test_packageindex.py =======================
...........going into /tmp/tmpL7HWiJ/src/10168/.tox/py27/lib/python2.7/site-packages/setuptools/tests
Reading http://127.0.0.1:33800/setuptools/tests/indexes/test_links_priority/simple/foobar/
127.0.0.1 - - [29/Jun/2015 11:50:21] code 404, message File not found
127.0.0.1 - - [29/Jun/2015 11:50:21] "GET /setuptools/tests/indexes/test_links_priority/simple/foobar/ HTTP/1.1" 404 -
Couldn't find index page for 'foobar' (maybe misspelled?)
Scanning index of all packages (this may take a while)
Reading http://127.0.0.1:33800/setuptools/tests/indexes/test_links_priority/simple/
127.0.0.1 - - [29/Jun/2015 11:50:21] code 404, message File not found
127.0.0.1 - - [29/Jun/2015 11:50:21] "GET /setuptools/tests/indexes/test_links_priority/simple/ HTTP/1.1" 404 -
127.0.0.1 - - [29/Jun/2015 11:50:21] "GET / HTTP/1.1" 200 -
F...
======================================================================
FAIL: test_links_priority (test_packageindex.TestPackageIndex)
----------------------------------------------------------------------
Traceback (most recent call last)
File "/usr/lib/python3.4/unittest/case.py", line 58, in testPartExecutor
yield
File "/usr/lib/python3.4/unittest/case.py", line 577, in run
testMethod()
File "/tmp/tmpL7HWiJ/src/10168/.tox/py27/lib/python2.7/site-packages/setuptools/tests/test_packageindex.py", line 130, in test_links_priority
self.assertTrue('foobar' in pi)
File "/usr/lib/python3.4/unittest/case.py", line 654, in assertTrue
raise self.failureException(msg)
AssertionError: False is not true

no stdout
no stderr
======================= test_easy_install.py =======================
unhandled exception occurred while testing test_easy_install
Traceback (most recent call last):
File "/tmp/tmpL7HWiJ/src/10168/.tox/py34/lib/python3.4/site-packages/logilab/common/pytest.py", line 440, in testfile
options=self.options, outstream=sys.stderr)
File "/tmp/tmpL7HWiJ/src/10168/.tox/py34/lib/python3.4/site-packages/logilab/common/pytest.py", line 756, in __init__
testLoader=NonStrictTestLoader())
File "/usr/lib/python3.4/unittest/main.py", line 63, in __init__
self.module = __import__(module)
File "/tmp/tmpL7HWiJ/src/10168/.tox/py27/lib/python2.7/site-packages/setuptools/tests/test_easy_install.py", line 26, in <module>
from .py26compat import skipIf
SystemError: Parent module '' not loaded, cannot perform relative import
======================== test_build_ext.py =========================
.
========================= test_sandbox.py ==========================
...
======================== test_dist_info.py =========================
..
========================== test_sdist.py ===========================
F./tmp/tmpL7HWiJ/src/10168/.tox/py27/lib/python2.7/site-packages/setuptools/tests/test_sdist.py:144: DeprecationWarning: 'U' mode is deprecated
manifest = open(mm.manifest, 'rbU')
...../tmp/tmpL7HWiJ/src/10168/.tox/py27/lib/python2.7/site-packages/setuptools/tests/test_sdist.py:187: DeprecationWarning: 'U' mode is deprecated
manifest = open(mm.manifest, 'rbU')
./tmp/tmpL7HWiJ/src/10168/.tox/py27/lib/python2.7/site-packages/setuptools/tests/test_sdist.py:228: DeprecationWarning: 'U' mode is deprecated
manifest = open(mm.manifest, 'rbU')
.F
======================================================================
FAIL: test_sources (test_sdist.TestDummyOutput)
----------------------------------------------------------------------
Traceback (most recent call last)
File "/usr/lib/python3.4/unittest/case.py", line 58, in testPartExecutor
yield
File "/usr/lib/python3.4/unittest/case.py", line 577, in run
testMethod()
File "/tmp/tmpL7HWiJ/src/10168/.tox/py27/lib/python2.7/site-packages/setuptools/tests/test_sdist.py", line 459, in test_sources
self._run()
File "/tmp/tmpL7HWiJ/src/10168/.tox/py27/lib/python2.7/site-packages/setuptools/tests/test_sdist.py", line 409, in _run
raise AssertionError(info)
AssertionError: DIR: /tmp/tmpL7HWiJ/src/10168/.tox/py27/lib/python2.7/site-packages/setuptools/tests
SDIST RETURNED: 2

no stdout
no stderr
======================================================================
FAIL: test_walksvn (test_sdist.TestSvn)
----------------------------------------------------------------------
Traceback (most recent call last)
File "/usr/lib/python3.4/unittest/case.py", line 58, in testPartExecutor
yield
File "/usr/lib/python3.4/unittest/case.py", line 577, in run
testMethod()
File "/tmp/tmpL7HWiJ/src/10168/.tox/py27/lib/python2.7/site-packages/setuptools/tests/test_sdist.py", line 520, in test_walksvn
self.assertEqual(set(x for x in walk_revctrl()), expected)
File "/usr/lib/python3.4/unittest/case.py", line 797, in assertEqual
assertion_func(first, second, msg=msg)
File "/usr/lib/python3.4/unittest/case.py", line 1049, in assertSetEqual
self.fail(self._formatMessage(msg, standardMsg))
File "/usr/lib/python3.4/unittest/case.py", line 642, in fail
raise self.failureException(msg)
AssertionError: Items in the second set but not the first:
'third party3/README.txt'
'folder/third party3/Changes.txt'
'third party3/Changes.txt'
'third party2/README.txt'
'folder/third party2/MD5SUMS'
'folder/lalala.txt'
'third party2/MD5SUMS'
'folder/third party3/WatashiNiYomimasu.txt'
'third party3/fin'
'folder/third party3/ZuMachen.txt'
'folder/quest.txt'
'third party3/TODO.txt'
'third party3/MD5SUMS'
'folder/third party3/oops'
'folder/third party2/WatashiNiYomimasu.txt'
'folder/third party3/MD5SUMS'
'a file'
'third party2/Changes.txt'
'folder/third party2/Changes.txt'
'folder/third_party/WatashiNiYomimasu.txt'
'folder/third party3/fin'
'third_party/README.txt'

no stdout
no stderr
=========================== test_test.py ===========================
.
========================= test_develop.py ==========================
.
======================= test_integration.py ========================
unhandled exception occurred while testing test_integration
Traceback (most recent call last):
File "/tmp/tmpL7HWiJ/src/10168/.tox/py34/lib/python3.4/site-packages/logilab/common/pytest.py", line 440, in testfile
options=self.options, outstream=sys.stderr)
File "/tmp/tmpL7HWiJ/src/10168/.tox/py34/lib/python3.4/site-packages/logilab/common/pytest.py", line 756, in __init__
testLoader=NonStrictTestLoader())
File "/usr/lib/python3.4/unittest/main.py", line 63, in __init__
self.module = __import__(module)
File "/tmp/tmpL7HWiJ/src/10168/.tox/py34/lib/python3.4/site-packages/setuptools/tests/test_integration.py", line 10, in <module>
import pytest
ImportError: No module named 'pytest'
======================= test_upload_docs.py ========================
.
====================== test_find_packages.py =======================
...........
======================== test_markerlib.py =========================
.
======================== test_bdist_egg.py =========================
/tmp/tmpL7HWiJ/src/10168/.tox/py34/lib/python3.4/site-packages/setuptools/command/sdist.py:236: DeprecationWarning: 'U' mode is deprecated
manifest = open(self.manifest, 'rbU')
zip_safe flag not set; analyzing archive contents...
.svn, version 1.8.10 (r1615264)
compiled Apr 1 2015, 02:54:56 on x86_64-pc-linux-gnu

Copyright (C) 2014 The Apache Software Foundation.
This software consists of contributions made by many people;
see the NOTICE file for more information.
Subversion is open source software, see http://subversion.apache.org/

The following repository access (RA) modules are available:

* ra_svn : Module for accessing a repository using the svn network protocol.
- with Cyrus SASL authentication
- handles 'svn' scheme
* ra_local : Module for accessing a repository on local disk.
- handles 'file' scheme
* ra_serf : Module for accessing a repository via WebDAV protocol using serf.
- using serf 1.3.8
- handles 'http' scheme
- handles 'https' scheme

======================== test_resources.py =========================
unhandled exception occurred while testing test_resources
Traceback (most recent call last):
File "/tmp/tmpL7HWiJ/src/10168/.tox/py34/lib/python3.4/site-packages/logilab/common/pytest.py", line 440, in testfile
options=self.options, outstream=sys.stderr)
File "/tmp/tmpL7HWiJ/src/10168/.tox/py34/lib/python3.4/site-packages/logilab/common/pytest.py", line 756, in __init__
testLoader=NonStrictTestLoader())
File "/usr/lib/python3.4/unittest/main.py", line 63, in __init__
self.module = __import__(module)
File "/tmp/tmpL7HWiJ/src/10168/.tox/py34/lib/python3.4/site-packages/setuptools/tests/test_resources.py", line 19, in <module>
from .py26compat import skipIf
SystemError: Parent module '' not loaded, cannot perform relative import
=========================== test_svn.py ============================
EEEEEEEEEEEEEEEEFFF..
======================================================================
ERROR: test_svn13 (test_svn.ParseExternal)
----------------------------------------------------------------------
Traceback (most recent call last)
File "/usr/lib/python3.4/unittest/case.py", line 58, in testPartExecutor
yield
File "/usr/lib/python3.4/unittest/case.py", line 577, in run
testMethod()
File "/tmp/tmpL7HWiJ/src/10168/.tox/py34/lib/python3.4/site-packages/setuptools/tests/test_svn.py", line 166, in test_svn13
self.parse_tester('svn13', False)
File "/tmp/tmpL7HWiJ/src/10168/.tox/py34/lib/python3.4/site-packages/setuptools/tests/test_svn.py", line 154, in parse_tester
data = _read_utf8_file(path)
File "/tmp/tmpL7HWiJ/src/10168/.tox/py34/lib/python3.4/site-packages/setuptools/tests/test_svn.py", line 56, in _read_utf8_file
fileobj = io.open(path, 'r', encoding='utf-8')
FileNotFoundError: [Errno 2] No such file or directory: 'setuptools/tests/svn_data/svn13_ext_list.txt'

no stdout
no stderr
======================================================================
ERROR: test_svn14 (test_svn.ParseExternal)
----------------------------------------------------------------------
Traceback (most recent call last)
File "/usr/lib/python3.4/unittest/case.py", line 58, in testPartExecutor
yield
File "/usr/lib/python3.4/unittest/case.py", line 577, in run
testMethod()
File "/tmp/tmpL7HWiJ/src/10168/.tox/py34/lib/python3.4/site-packages/setuptools/tests/test_svn.py", line 169, in test_svn14
self.parse_tester('svn14', False)
File "/tmp/tmpL7HWiJ/src/10168/.tox/py34/lib/python3.4/site-packages/setuptools/tests/test_svn.py", line 154, in parse_tester
data = _read_utf8_file(path)
File "/tmp/tmpL7HWiJ/src/10168/.tox/py34/lib/python3.4/site-packages/setuptools/tests/test_svn.py", line 56, in _read_utf8_file
fileobj = io.open(path, 'r', encoding='utf-8')
FileNotFoundError: [Errno 2] No such file or directory: 'setuptools/tests/svn_data/svn14_ext_list.txt'

no stdout
no stderr
======================================================================
ERROR: test_svn15 (test_svn.ParseExternal)
----------------------------------------------------------------------
Traceback (most recent call last)
File "/usr/lib/python3.4/unittest/case.py", line 58, in testPartExecutor
yield
File "/usr/lib/python3.4/unittest/case.py", line 577, in run
testMethod()
File "/tmp/tmpL7HWiJ/src/10168/.tox/py34/lib/python3.4/site-packages/setuptools/tests/test_svn.py", line 172, in test_svn15
self.parse_tester('svn15', False)
File "/tmp/tmpL7HWiJ/src/10168/.tox/py34/lib/python3.4/site-packages/setuptools/tests/test_svn.py", line 154, in parse_tester
data = _read_utf8_file(path)
File "/tmp/tmpL7HWiJ/src/10168/.tox/py34/lib/python3.4/site-packages/setuptools/tests/test_svn.py", line 56, in _read_utf8_file
fileobj = io.open(path, 'r', encoding='utf-8')
FileNotFoundError: [Errno 2] No such file or directory: 'setuptools/tests/svn_data/svn15_ext_list.txt'

no stdout
no stderr
======================================================================
ERROR: test_svn16 (test_svn.ParseExternal)
----------------------------------------------------------------------
Traceback (most recent call last)
File "/usr/lib/python3.4/unittest/case.py", line 58, in testPartExecutor
yield
File "/usr/lib/python3.4/unittest/case.py", line 577, in run
testMethod()
File "/tmp/tmpL7HWiJ/src/10168/.tox/py34/lib/python3.4/site-packages/setuptools/tests/test_svn.py", line 175, in test_svn16
self.parse_tester('svn16', True)
File "/tmp/tmpL7HWiJ/src/10168/.tox/py34/lib/python3.4/site-packages/setuptools/tests/test_svn.py", line 154, in parse_tester
data = _read_utf8_file(path)
File "/tmp/tmpL7HWiJ/src/10168/.tox/py34/lib/python3.4/site-packages/setuptools/tests/test_svn.py", line 56, in _read_utf8_file
fileobj = io.open(path, 'r', encoding='utf-8')
FileNotFoundError: [Errno 2] No such file or directory: 'setuptools/tests/svn_data/svn16_ext_list.txt'

no stdout
no stderr
======================================================================
ERROR: test_svn17 (test_svn.ParseExternal)
----------------------------------------------------------------------
Traceback (most recent call last)
File "/usr/lib/python3.4/unittest/case.py", line 58, in testPartExecutor
yield
File "/usr/lib/python3.4/unittest/case.py", line 577, in run
testMethod()
File "/tmp/tmpL7HWiJ/src/10168/.tox/py34/lib/python3.4/site-packages/setuptools/tests/test_svn.py", line 178, in test_svn17
self.parse_tester('svn17', True)
File "/tmp/tmpL7HWiJ/src/10168/.tox/py34/lib/python3.4/site-packages/setuptools/tests/test_svn.py", line 154, in parse_tester
data = _read_utf8_file(path)
File "/tmp/tmpL7HWiJ/src/10168/.tox/py34/lib/python3.4/site-packages/setuptools/tests/test_svn.py", line 56, in _read_utf8_file
fileobj = io.open(path, 'r', encoding='utf-8')
FileNotFoundError: [Errno 2] No such file or directory: 'setuptools/tests/svn_data/svn17_ext_list.txt'

no stdout
no stderr
======================================================================
ERROR: test_svn18 (test_svn.ParseExternal)
----------------------------------------------------------------------
Traceback (most recent call last)
File "/usr/lib/python3.4/unittest/case.py", line 58, in testPartExecutor
yield
File "/usr/lib/python3.4/unittest/case.py", line 577, in run
testMethod()
File "/tmp/tmpL7HWiJ/src/10168/.tox/py34/lib/python3.4/site-packages/setuptools/tests/test_svn.py", line 181, in test_svn18
self.parse_tester('svn18', True)
File "/tmp/tmpL7HWiJ/src/10168/.tox/py34/lib/python3.4/site-packages/setuptools/tests/test_svn.py", line 154, in parse_tester
data = _read_utf8_file(path)
File "/tmp/tmpL7HWiJ/src/10168/.tox/py34/lib/python3.4/site-packages/setuptools/tests/test_svn.py", line 56, in _read_utf8_file
fileobj = io.open(path, 'r', encoding='utf-8')
FileNotFoundError: [Errno 2] No such file or directory: 'setuptools/tests/svn_data/svn18_ext_list.txt'

no stdout
no stderr
======================================================================
ERROR: test_svn15 (test_svn.ParserExternalXML)
----------------------------------------------------------------------
Traceback (most recent call last)
File "/usr/lib/python3.4/unittest/case.py", line 58, in testPartExecutor
yield
File "/usr/lib/python3.4/unittest/case.py", line 577, in run
testMethod()
File "/tmp/tmpL7HWiJ/src/10168/.tox/py34/lib/python3.4/site-packages/setuptools/tests/test_svn.py", line 137, in test_svn15
self.parse_tester('svn15', False)
File "/tmp/tmpL7HWiJ/src/10168/.tox/py34/lib/python3.4/site-packages/setuptools/tests/test_svn.py", line 108, in parse_tester
data = _read_utf8_file(path)
File "/tmp/tmpL7HWiJ/src/10168/.tox/py34/lib/python3.4/site-packages/setuptools/tests/test_svn.py", line 56, in _read_utf8_file
fileobj = io.open(path, 'r', encoding='utf-8')
FileNotFoundError: [Errno 2] No such file or directory: 'setuptools/tests/svn_data/svn15_ext_list.xml'

no stdout
no stderr
======================================================================
ERROR: test_svn16 (test_svn.ParserExternalXML)
----------------------------------------------------------------------
Traceback (most recent call last)
File "/usr/lib/python3.4/unittest/case.py", line 58, in testPartExecutor
yield
File "/usr/lib/python3.4/unittest/case.py", line 577, in run
testMethod()
File "/tmp/tmpL7HWiJ/src/10168/.tox/py34/lib/python3.4/site-packages/setuptools/tests/test_svn.py", line 140, in test_svn16
self.parse_tester('svn16', True)
File "/tmp/tmpL7HWiJ/src/10168/.tox/py34/lib/python3.4/site-packages/setuptools/tests/test_svn.py", line 108, in parse_tester
data = _read_utf8_file(path)
File "/tmp/tmpL7HWiJ/src/10168/.tox/py34/lib/python3.4/site-packages/setuptools/tests/test_svn.py", line 56, in _read_utf8_file
fileobj = io.open(path, 'r', encoding='utf-8')
FileNotFoundError: [Errno 2] No such file or directory: 'setuptools/tests/svn_data/svn16_ext_list.xml'

no stdout
no stderr
======================================================================
ERROR: test_svn17 (test_svn.ParserExternalXML)
----------------------------------------------------------------------
Traceback (most recent call last)
File "/usr/lib/python3.4/unittest/case.py", line 58, in testPartExecutor
yield
File "/usr/lib/python3.4/unittest/case.py", line 577, in run
testMethod()
File "/tmp/tmpL7HWiJ/src/10168/.tox/py34/lib/python3.4/site-packages/setuptools/tests/test_svn.py", line 143, in test_svn17
self.parse_tester('svn17', True)
File "/tmp/tmpL7HWiJ/src/10168/.tox/py34/lib/python3.4/site-packages/setuptools/tests/test_svn.py", line 108, in parse_tester
data = _read_utf8_file(path)
File "/tmp/tmpL7HWiJ/src/10168/.tox/py34/lib/python3.4/site-packages/setuptools/tests/test_svn.py", line 56, in _read_utf8_file
fileobj = io.open(path, 'r', encoding='utf-8')
FileNotFoundError: [Errno 2] No such file or directory: 'setuptools/tests/svn_data/svn17_ext_list.xml'

no stdout
no stderr
======================================================================
ERROR: test_svn18 (test_svn.ParserExternalXML)
----------------------------------------------------------------------
Traceback (most recent call last)
File "/usr/lib/python3.4/unittest/case.py", line 58, in testPartExecutor
yield
File "/usr/lib/python3.4/unittest/case.py", line 577, in run
testMethod()
File "/tmp/tmpL7HWiJ/src/10168/.tox/py34/lib/python3.4/site-packages/setuptools/tests/test_svn.py", line 146, in test_svn18
self.parse_tester('svn18', True)
File "/tmp/tmpL7HWiJ/src/10168/.tox/py34/lib/python3.4/site-packages/setuptools/tests/test_svn.py", line 108, in parse_tester
data = _read_utf8_file(path)
File "/tmp/tmpL7HWiJ/src/10168/.tox/py34/lib/python3.4/site-packages/setuptools/tests/test_svn.py", line 56, in _read_utf8_file
fileobj = io.open(path, 'r', encoding='utf-8')
FileNotFoundError: [Errno 2] No such file or directory: 'setuptools/tests/svn_data/svn18_ext_list.xml'

no stdout
no stderr
======================================================================
ERROR: test_svn13 (test_svn.ParserInfoXML)
----------------------------------------------------------------------
Traceback (most recent call last)
File "/usr/lib/python3.4/unittest/case.py", line 58, in testPartExecutor
yield
File "/usr/lib/python3.4/unittest/case.py", line 577, in run
testMethod()
File "/tmp/tmpL7HWiJ/src/10168/.tox/py34/lib/python3.4/site-packages/setuptools/tests/test_svn.py", line 85, in test_svn13
self.parse_tester('svn13', False)
File "/tmp/tmpL7HWiJ/src/10168/.tox/py34/lib/python3.4/site-packages/setuptools/tests/test_svn.py", line 73, in parse_tester
data = _read_utf8_file(path)
File "/tmp/tmpL7HWiJ/src/10168/.tox/py34/lib/python3.4/site-packages/setuptools/tests/test_svn.py", line 56, in _read_utf8_file
fileobj = io.open(path, 'r', encoding='utf-8')
FileNotFoundError: [Errno 2] No such file or directory: 'setuptools/tests/svn_data/svn13_info.xml'

no stdout
no stderr
======================================================================
ERROR: test_svn14 (test_svn.ParserInfoXML)
----------------------------------------------------------------------
Traceback (most recent call last)
File "/usr/lib/python3.4/unittest/case.py", line 58, in testPartExecutor
yield
File "/usr/lib/python3.4/unittest/case.py", line 577, in run
testMethod()
File "/tmp/tmpL7HWiJ/src/10168/.tox/py34/lib/python3.4/site-packages/setuptools/tests/test_svn.py", line 88, in test_svn14
self.parse_tester('svn14', False)
File "/tmp/tmpL7HWiJ/src/10168/.tox/py34/lib/python3.4/site-packages/setuptools/tests/test_svn.py", line 73, in parse_tester
data = _read_utf8_file(path)
File "/tmp/tmpL7HWiJ/src/10168/.tox/py34/lib/python3.4/site-packages/setuptools/tests/test_svn.py", line 56, in _read_utf8_file
fileobj = io.open(path, 'r', encoding='utf-8')
FileNotFoundError: [Errno 2] No such file or directory: 'setuptools/tests/svn_data/svn14_info.xml'

no stdout
no stderr
======================================================================
ERROR: test_svn15 (test_svn.ParserInfoXML)
----------------------------------------------------------------------
Traceback (most recent call last)
File "/usr/lib/python3.4/unittest/case.py", line 58, in testPartExecutor
yield
File "/usr/lib/python3.4/unittest/case.py", line 577, in run
testMethod()
File "/tmp/tmpL7HWiJ/src/10168/.tox/py34/lib/python3.4/site-packages/setuptools/tests/test_svn.py", line 91, in test_svn15
self.parse_tester('svn15', False)
File "/tmp/tmpL7HWiJ/src/10168/.tox/py34/lib/python3.4/site-packages/setuptools/tests/test_svn.py", line 73, in parse_tester
data = _read_utf8_file(path)
File "/tmp/tmpL7HWiJ/src/10168/.tox/py34/lib/python3.4/site-packages/setuptools/tests/test_svn.py", line 56, in _read_utf8_file
fileobj = io.open(path, 'r', encoding='utf-8')
FileNotFoundError: [Errno 2] No such file or directory: 'setuptools/tests/svn_data/svn15_info.xml'

no stdout
no stderr
======================================================================
ERROR: test_svn16 (test_svn.ParserInfoXML)
----------------------------------------------------------------------
Traceback (most recent call last)
File "/usr/lib/python3.4/unittest/case.py", line 58, in testPartExecutor
yield
File "/usr/lib/python3.4/unittest/case.py", line 577, in run
testMethod()
File "/tmp/tmpL7HWiJ/src/10168/.tox/py34/lib/python3.4/site-packages/setuptools/tests/test_svn.py", line 94, in test_svn16
self.parse_tester('svn16', True)
File "/tmp/tmpL7HWiJ/src/10168/.tox/py34/lib/python3.4/site-packages/setuptools/tests/test_svn.py", line 73, in parse_tester
data = _read_utf8_file(path)
File "/tmp/tmpL7HWiJ/src/10168/.tox/py34/lib/python3.4/site-packages/setuptools/tests/test_svn.py", line 56, in _read_utf8_file
fileobj = io.open(path, 'r', encoding='utf-8')
FileNotFoundError: [Errno 2] No such file or directory: 'setuptools/tests/svn_data/svn16_info.xml'

no stdout
no stderr
======================================================================
ERROR: test_svn17 (test_svn.ParserInfoXML)
----------------------------------------------------------------------
Traceback (most recent call last)
File "/usr/lib/python3.4/unittest/case.py", line 58, in testPartExecutor
yield
File "/usr/lib/python3.4/unittest/case.py", line 577, in run
testMethod()
File "/tmp/tmpL7HWiJ/src/10168/.tox/py34/lib/python3.4/site-packages/setuptools/tests/test_svn.py", line 97, in test_svn17
self.parse_tester('svn17', True)
File "/tmp/tmpL7HWiJ/src/10168/.tox/py34/lib/python3.4/site-packages/setuptools/tests/test_svn.py", line 73, in parse_tester
data = _read_utf8_file(path)
File "/tmp/tmpL7HWiJ/src/10168/.tox/py34/lib/python3.4/site-packages/setuptools/tests/test_svn.py", line 56, in _read_utf8_file
fileobj = io.open(path, 'r', encoding='utf-8')
FileNotFoundError: [Errno 2] No such file or directory: 'setuptools/tests/svn_data/svn17_info.xml'

no stdout
no stderr
======================================================================
ERROR: test_svn18 (test_svn.ParserInfoXML)
----------------------------------------------------------------------
Traceback (most recent call last)
File "/usr/lib/python3.4/unittest/case.py", line 58, in testPartExecutor
yield
File "/usr/lib/python3.4/unittest/case.py", line 577, in run
testMethod()
File "/tmp/tmpL7HWiJ/src/10168/.tox/py34/lib/python3.4/site-packages/setuptools/tests/test_svn.py", line 100, in test_svn18
self.parse_tester('svn18', True)
File "/tmp/tmpL7HWiJ/src/10168/.tox/py34/lib/python3.4/site-packages/setuptools/tests/test_svn.py", line 73, in parse_tester
data = _read_utf8_file(path)
File "/tmp/tmpL7HWiJ/src/10168/.tox/py34/lib/python3.4/site-packages/setuptools/tests/test_svn.py", line 56, in _read_utf8_file
fileobj = io.open(path, 'r', encoding='utf-8')
FileNotFoundError: [Errno 2] No such file or directory: 'setuptools/tests/svn_data/svn18_info.xml'

no stdout
no stderr
======================================================================
FAIL: test_entries (test_svn.TestSvn)
----------------------------------------------------------------------
Traceback (most recent call last)
File "/usr/lib/python3.4/unittest/case.py", line 58, in testPartExecutor
yield
File "/usr/lib/python3.4/unittest/case.py", line 577, in run
testMethod()
File "/tmp/tmpL7HWiJ/src/10168/.tox/py34/lib/python3.4/site-packages/setuptools/tests/test_svn.py", line 222, in test_entries
self.assertEqual(set(x for x in info.entries), expected)
File "/usr/lib/python3.4/unittest/case.py", line 797, in assertEqual
assertion_func(first, second, msg=msg)
File "/usr/lib/python3.4/unittest/case.py", line 1049, in assertSetEqual
self.fail(self._formatMessage(msg, standardMsg))
File "/usr/lib/python3.4/unittest/case.py", line 642, in fail
raise self.failureException(msg)
AssertionError: Items in the second set but not the first:
('folder/lalala.txt', 'file')
('folder', 'dir')
('a file', 'file')
('folder/quest.txt', 'file')

no stdout
no stderr
======================================================================
FAIL: test_externals (test_svn.TestSvn)
----------------------------------------------------------------------
Traceback (most recent call last)
File "/usr/lib/python3.4/unittest/case.py", line 58, in testPartExecutor
yield
File "/usr/lib/python3.4/unittest/case.py", line 577, in run
testMethod()
File "/tmp/tmpL7HWiJ/src/10168/.tox/py34/lib/python3.4/site-packages/setuptools/tests/test_svn.py", line 242, in test_externals
self.assertEqual(set([x for x in info.externals]), expected)
File "/usr/lib/python3.4/unittest/case.py", line 797, in assertEqual
assertion_func(first, second, msg=msg)
File "/usr/lib/python3.4/unittest/case.py", line 1049, in assertSetEqual
self.fail(self._formatMessage(msg, standardMsg))
File "/usr/lib/python3.4/unittest/case.py", line 642, in fail
raise self.failureException(msg)
AssertionError: Items in the second set but not the first:
'folder/third_party'
'folder/third party3'
'folder/third party2'
'third_party'
'third party2'
'third party3'

no stdout
no stderr
======================================================================
FAIL: test_revision (test_svn.TestSvn)
----------------------------------------------------------------------
Traceback (most recent call last)
File "/usr/lib/python3.4/unittest/case.py", line 58, in testPartExecutor
yield
File "/usr/lib/python3.4/unittest/case.py", line 577, in run
testMethod()
File "/tmp/tmpL7HWiJ/src/10168/.tox/py34/lib/python3.4/site-packages/setuptools/tests/test_svn.py", line 209, in test_revision
self.assertEqual(rev, 6)
File "/usr/lib/python3.4/unittest/case.py", line 797, in assertEqual
assertion_func(first, second, msg=msg)
File "/usr/lib/python3.4/unittest/case.py", line 790, in _baseAssertEqual
raise self.failureException(msg)
AssertionError: 0 != 6

no stdout
no stderr
========================= test_egg_info.py =========================
unhandled exception occurred while testing test_egg_info
Traceback (most recent call last):
File "/tmp/tmpL7HWiJ/src/10168/.tox/py34/lib/python3.4/site-packages/logilab/common/pytest.py", line 440, in testfile
options=self.options, outstream=sys.stderr)
File "/tmp/tmpL7HWiJ/src/10168/.tox/py34/lib/python3.4/site-packages/logilab/common/pytest.py", line 756, in __init__
testLoader=NonStrictTestLoader())
File "/usr/lib/python3.4/unittest/main.py", line 63, in __init__
self.module = __import__(module)
File "/tmp/tmpL7HWiJ/src/10168/.tox/py34/lib/python3.4/site-packages/setuptools/tests/test_egg_info.py", line 15, in <module>
ENTRIES_V10 = pkg_resources.resource_string(__name__, 'entries-v10')
File "/tmp/tmpL7HWiJ/src/10168/.tox/py34/lib/python3.4/site-packages/pkg_resources.py", line 966, in resource_string
self, resource_name
File "/tmp/tmpL7HWiJ/src/10168/.tox/py34/lib/python3.4/site-packages/pkg_resources.py", line 1393, in get_resource_string
return self._get(self._fn(self.module_path, resource_name))
File "/tmp/tmpL7HWiJ/src/10168/.tox/py34/lib/python3.4/site-packages/pkg_resources.py", line 1514, in _get
with open(path, 'rb') as stream:
FileNotFoundError: [Errno 2] No such file or directory: '/tmp/tmpL7HWiJ/src/10168/.tox/py34/lib/python3.4/site-packages/setuptools/tests/entries-v10'
======================= test_packageindex.py =======================
...........going into /tmp/tmpL7HWiJ/src/10168/.tox/py34/lib/python3.4/site-packages/setuptools/tests
Reading http://127.0.0.1:41975/setuptools/tests/indexes/test_links_priority/simple/foobar/
127.0.0.1 - - [29/Jun/2015 11:50:22] code 404, message File not found
127.0.0.1 - - [29/Jun/2015 11:50:22] "GET /setuptools/tests/indexes/test_links_priority/simple/foobar/ HTTP/1.1" 404 -
Couldn't find index page for 'foobar' (maybe misspelled?)
Scanning index of all packages (this may take a while)
Reading http://127.0.0.1:41975/setuptools/tests/indexes/test_links_priority/simple/
127.0.0.1 - - [29/Jun/2015 11:50:22] code 404, message File not found
127.0.0.1 - - [29/Jun/2015 11:50:22] "GET /setuptools/tests/indexes/test_links_priority/simple/ HTTP/1.1" 404 -
127.0.0.1 - - [29/Jun/2015 11:50:22] "GET / HTTP/1.1" 200 -
F...
======================================================================
FAIL: test_links_priority (test_packageindex.TestPackageIndex)
----------------------------------------------------------------------
Traceback (most recent call last)
File "/usr/lib/python3.4/unittest/case.py", line 58, in testPartExecutor
yield
File "/usr/lib/python3.4/unittest/case.py", line 577, in run
testMethod()
File "/tmp/tmpL7HWiJ/src/10168/.tox/py34/lib/python3.4/site-packages/setuptools/tests/test_packageindex.py", line 130, in test_links_priority
self.assertTrue('foobar' in pi)
File "/usr/lib/python3.4/unittest/case.py", line 654, in assertTrue
raise self.failureException(msg)
AssertionError: False is not true

no stdout
no stderr
======================= test_easy_install.py =======================
unhandled exception occurred while testing test_easy_install
Traceback (most recent call last):
File "/tmp/tmpL7HWiJ/src/10168/.tox/py34/lib/python3.4/site-packages/logilab/common/pytest.py", line 440, in testfile
options=self.options, outstream=sys.stderr)
File "/tmp/tmpL7HWiJ/src/10168/.tox/py34/lib/python3.4/site-packages/logilab/common/pytest.py", line 756, in __init__
testLoader=NonStrictTestLoader())
File "/usr/lib/python3.4/unittest/main.py", line 63, in __init__
self.module = __import__(module)
File "/tmp/tmpL7HWiJ/src/10168/.tox/py34/lib/python3.4/site-packages/setuptools/tests/test_easy_install.py", line 26, in <module>
from .py26compat import skipIf
SystemError: Parent module '' not loaded, cannot perform relative import
======================== test_build_ext.py =========================
.
========================= test_sandbox.py ==========================
...
======================== test_dist_info.py =========================
..
========================== test_sdist.py ===========================
F./tmp/tmpL7HWiJ/src/10168/.tox/py34/lib/python3.4/site-packages/setuptools/tests/test_sdist.py:144: DeprecationWarning: 'U' mode is deprecated
manifest = open(mm.manifest, 'rbU')
...../tmp/tmpL7HWiJ/src/10168/.tox/py34/lib/python3.4/site-packages/setuptools/tests/test_sdist.py:187: DeprecationWarning: 'U' mode is deprecated
manifest = open(mm.manifest, 'rbU')
./tmp/tmpL7HWiJ/src/10168/.tox/py34/lib/python3.4/site-packages/setuptools/tests/test_sdist.py:228: DeprecationWarning: 'U' mode is deprecated
manifest = open(mm.manifest, 'rbU')
.F
======================================================================
FAIL: test_sources (test_sdist.TestDummyOutput)
----------------------------------------------------------------------
Traceback (most recent call last)
File "/usr/lib/python3.4/unittest/case.py", line 58, in testPartExecutor
yield
File "/usr/lib/python3.4/unittest/case.py", line 577, in run
testMethod()
File "/tmp/tmpL7HWiJ/src/10168/.tox/py34/lib/python3.4/site-packages/setuptools/tests/test_sdist.py", line 459, in test_sources
self._run()
File "/tmp/tmpL7HWiJ/src/10168/.tox/py34/lib/python3.4/site-packages/setuptools/tests/test_sdist.py", line 409, in _run
raise AssertionError(info)
AssertionError: DIR: /tmp/tmpL7HWiJ/src/10168/.tox/py34/lib/python3.4/site-packages/setuptools/tests
SDIST RETURNED: 2

no stdout
no stderr
======================================================================
FAIL: test_walksvn (test_sdist.TestSvn)
----------------------------------------------------------------------
Traceback (most recent call last)
File "/usr/lib/python3.4/unittest/case.py", line 58, in testPartExecutor
yield
File "/usr/lib/python3.4/unittest/case.py", line 577, in run
testMethod()
File "/tmp/tmpL7HWiJ/src/10168/.tox/py34/lib/python3.4/site-packages/setuptools/tests/test_sdist.py", line 520, in test_walksvn
self.assertEqual(set(x for x in walk_revctrl()), expected)
File "/usr/lib/python3.4/unittest/case.py", line 797, in assertEqual
assertion_func(first, second, msg=msg)
File "/usr/lib/python3.4/unittest/case.py", line 1049, in assertSetEqual
self.fail(self._formatMessage(msg, standardMsg))
File "/usr/lib/python3.4/unittest/case.py", line 642, in fail
raise self.failureException(msg)
AssertionError: Items in the second set but not the first:
'third party3/README.txt'
'folder/third party3/Changes.txt'
'third party3/Changes.txt'
'third party2/README.txt'
'folder/third party2/MD5SUMS'
'folder/lalala.txt'
'third party2/MD5SUMS'
'folder/third party3/WatashiNiYomimasu.txt'
'third party3/fin'
'folder/third party3/ZuMachen.txt'
'folder/quest.txt'
'third party3/TODO.txt'
'third party3/MD5SUMS'
'folder/third party3/oops'
'folder/third party2/WatashiNiYomimasu.txt'
'folder/third party3/MD5SUMS'
'a file'
'third party2/Changes.txt'
'folder/third party2/Changes.txt'
'folder/third_party/WatashiNiYomimasu.txt'
'folder/third party3/fin'
'third_party/README.txt'

no stdout
no stderr
=========================== test_test.py ===========================
.
======================= unittest_testlib.py ========================
........../tmp/tmpL7HWiJ/src/10168/.tox/py34/lib/python3.4/site-packages/logilab/common/testlib.py:591: DeprecationWarning: Please use assertTrue instead.
testfunc(*args, **kwargs)
.................................................................../tmp/tmpL7HWiJ/src/10168/test/unittest_testlib.py:153: DeprecationWarning: Non-standard: please copy test method to your TestCase class
self.assertDirEqual(ed1, ed2)
/tmp/tmpL7HWiJ/src/10168/test/unittest_testlib.py:154: DeprecationWarning: Non-standard: please copy test method to your TestCase class
self.assertDirEqual(ref, ref)
/tmp/tmpL7HWiJ/src/10168/.tox/py34/lib/python3.4/site-packages/logilab/common/testlib.py:1004: DeprecationWarning: Non-standard: please copy test method to your TestCase class
osp.join(path_b, ipath_b, ifiles_b[index]))
/tmp/tmpL7HWiJ/src/10168/.tox/py34/lib/python3.4/site-packages/logilab/common/testlib.py:943: DeprecationWarning: Non-standard: please copy test method to your TestCase class
msg_prefix='Files differs\n-:%s\n+:%s\n'%(fname1, fname2))
/tmp/tmpL7HWiJ/src/10168/test/unittest_testlib.py:155: DeprecationWarning: Non-standard: please copy test method to your TestCase class
self.assertDirEqual( ref, same)
/tmp/tmpL7HWiJ/src/10168/.tox/py34/lib/python3.4/site-packages/logilab/common/testlib.py:1095: DeprecationWarning: Non-standard: please copy test method to your TestCase class
callableObj(*args, **kwargs)
../tmp/tmpL7HWiJ/src/10168/test/unittest_testlib.py:139: DeprecationWarning: Non-standard: please copy test method to your TestCase class
self.tc.assertFileEqual(foo, foo)
........./tmp/tmpL7HWiJ/src/10168/test/unittest_testlib.py:166: DeprecationWarning: Non-standard: please copy test method to your TestCase class
self.tc.assertStreamEqual(stream1, stream1)
../tmp/tmpL7HWiJ/src/10168/test/unittest_testlib.py:123: DeprecationWarning: Non-standard: please copy test method to your TestCase class
self.tc.assertXMLStringWellFormed(valid)
...
====================== unittest_interface.py =======================
.....
========================= unittest_tree.py =========================
........................
===================== unittest_deprecation.py ======================
.......
==================== unittest_configuration.py =====================
.................
====================== unittest_fileutils.py =======================
..../tmp/tmpL7HWiJ/src/10168/.tox/py34/lib/python3.4/site-packages/logilab/common/fileutils.py:291: DeprecationWarning: 'U' mode is deprecated
stream = open(path, 'U')
../tmp/tmpL7HWiJ/src/10168/test/unittest_fileutils.py:56: DeprecationWarning: 'U' mode is deprecated
data = open(NEWLINES_TXT, 'U').read()
....
====================== unittest_textutils.py =======================
.........................................
======================= unittest_xmlutils.py =======================
.....
====================== unittest_changelog.py =======================
.
====================== unittest_decorators.py ======================
.............
======================= unittest_umessage.py =======================
....
======================== unittest_table.py =========================
.....................................
======================== unittest_graph.py =========================
..............
====================== unittest_shellutils.py ======================
.......................
======================== unittest_cache.py =========================
........
====================== unittest_taskqueue.py =======================
.....
==================== unittest_ureports_html.py =====================
.......
========================= unittest_date.py =========================
unhandled exception occurred while testing unittest_date
Traceback (most recent call last):
File "/tmp/tmpL7HWiJ/src/10168/.tox/py34/lib/python3.4/site-packages/logilab/common/pytest.py", line 440, in testfile
options=self.options, outstream=sys.stderr)
File "/tmp/tmpL7HWiJ/src/10168/.tox/py34/lib/python3.4/site-packages/logilab/common/pytest.py", line 756, in __init__
testLoader=NonStrictTestLoader())
File "/usr/lib/python3.4/unittest/main.py", line 63, in __init__
self.module = __import__(module)
File "/tmp/tmpL7HWiJ/src/10168/test/unittest_date.py", line 28, in <module>
import pytz
ImportError: No module named 'pytz'
======================== unittest_pytest.py ========================
/tmp/tmpL7HWiJ/src/10168/test/unittest_pytest.py:89: DeprecationWarning: [lgc 0.63.1] Use the pause_trace() context manager
pause_tracing()
/tmp/tmpL7HWiJ/src/10168/test/unittest_pytest.py:92: DeprecationWarning: [lgc 0.63.1] Use the pause_trace() context manager
pause_tracing()
/tmp/tmpL7HWiJ/src/10168/test/unittest_pytest.py:94: DeprecationWarning: [lgc 0.63.1] Use the pause_trace() context manager
resume_tracing()
/tmp/tmpL7HWiJ/src/10168/test/unittest_pytest.py:97: DeprecationWarning: [lgc 0.63.1] Use the pause_trace() context manager
resume_tracing()
......
======================= unittest_registry.py =======================
............
==================== unittest_ureports_text.py =====================
.......
======================= unittest_modutils.py =======================
......................F.............
======================================================================
FAIL: test_4 (unittest_modutils.is_standard_module_tc)
----------------------------------------------------------------------
Traceback (most recent call last)
File "/tmp/tmpL7HWiJ/src/10168/test/unittest_modutils.py", line 209, in test_4
self.assertEqual(modutils.is_standard_module('hashlib'), True)
File "/usr/lib/python3.4/unittest/case.py", line 797, in assertEqual
assertion_func(first, second, msg=msg)
File "/usr/lib/python3.4/unittest/case.py", line 790, in _baseAssertEqual
raise self.failureException(msg)
AssertionError: False != True

no stdout
no stderr
going into /tmp/tmpL7HWiJ/src/10168/test
*******************************************************************************
Ran 520 test cases in 12.97s (0.99s CPU), 41 errors, 13 failures
38 modules OK (16 failed)
failures: /tmp/tmpL7HWiJ/src/10168/.tox/py27/lib/python2.7/site-packages/setuptools/tests/test_integration [1/1], /tmp/tmpL7HWiJ/src/10168/.tox/py27/lib/python2.7/site-packages/setuptools/tests/test_resources [1/1], /tmp/tmpL7HWiJ/src/10168/.tox/py27/lib/python2.7/site-packages/setuptools/tests/test_svn [19/21], /tmp/tmpL7HWiJ/src/10168/.tox/py27/lib/python2.7/site-packages/setuptools/tests/test_egg_info [1/1], /tmp/tmpL7HWiJ/src/10168/.tox/py27/lib/python2.7/site-packages/setuptools/tests/test_packageindex [1/15], /tmp/tmpL7HWiJ/src/10168/.tox/py27/lib/python2.7/site-packages/setuptools/tests/test_easy_install [1/1], /tmp/tmpL7HWiJ/src/10168/.tox/py27/lib/python2.7/site-packages/setuptools/tests/test_sdist [2/10], /tmp/tmpL7HWiJ/src/10168/.tox/py34/lib/python3.4/site-packages/setuptools/tests/test_integration [1/1], /tmp/tmpL7HWiJ/src/10168/.tox/py34/lib/python3.4/site-packages/setuptools/tests/test_resources [1/1], /tmp/tmpL7HWiJ/src/10168/.tox/py34/lib/python3.4/site-packages/setuptools/tests/test_svn [19/21], /tmp/tmpL7HWiJ/src/10168/.tox/py34/lib/python3.4/site-packages/setuptools/tests/test_egg_info [1/1], /tmp/tmpL7HWiJ/src/10168/.tox/py34/lib/python3.4/site-packages/setuptools/tests/test_packageindex [1/15], /tmp/tmpL7HWiJ/src/10168/.tox/py34/lib/python3.4/site-packages/setuptools/tests/test_easy_install [1/1], /tmp/tmpL7HWiJ/src/10168/.tox/py34/lib/python3.4/site-packages/setuptools/tests/test_sdist [2/10], /tmp/tmpL7HWiJ/src/10168/test/unittest_date [1/1], /tmp/tmpL7HWiJ/src/10168/test/unittest_modutils [1/36]
ERROR: InvocationError: '/tmp/tmpL7HWiJ/src/10168/.tox/py34/bin/pytest'
___________________________________ summary ____________________________________
ERROR: py27: commands failed
ERROR: py34: commands failed
<br/>50 Error while running checker tox: `tox` returned with status : 1
Traceback (most recent call last):
File &quot;/tmp/tmpAaidxQ.py&quot;, line 42, in &lt;module&gt;
Command(toxw, [&#39;tox&#39;], raises=True, cwd=dst_dir).run()
File &quot;/usr/lib/python2.7/dist-packages/apycotlib/__init__.py&quot;, line 279, in run
self.handle_output(cmd.returncode, outfile, None)
File &quot;/usr/lib/python2.7/dist-packages/apycotlib/__init__.py&quot;, line 309, in handle_output
raise SetupException(short_msg)
SetupException: `tox` returned with status : 1
<br/>

log from execution