log_file.txt

download

20 lgp_sign=yes
lgp_suffix=yes<br/>10 use setup package class format: PackageInfo<br/>10 guessing distribution(s): jessie, trusty, wheezy, epel-6-i386, utopic, epel-7-x86_64, sid, epel-6-x86_64<br/>10 run subprocess command: python setup.py --name<br/>10 run subprocess command: python setup.py --version<br/>10 retrieve debian version from debian/changelog: 0.25.0-1<br/>20 create pristine tarball from working directory<br/>10 run subprocess command: python setup.py -q sdist -d /tmp/tmpiRBNck<br/>10 command substitutions: {&#39;dist_dir&#39;: &#39;/tmp/tmpiRBNck&#39;}<br/>10 copy pristine tarball to prepare Debian source package diff<br/>10 extracting original source archive for jessie distribution in /tmp/tmp_EZUJg<br/>10 suffix &#39;~rev1244&#39; added to package version<br/>20 Debian source package (format: 3.0 (quilt)) for &#39;jessie&#39;<br/>10 running dpkg-source command: dpkg-source -b /tmp/tmp_EZUJg/logilab-devtools-0.25.0 ...<br/>20 create Debian source package files (.dsc, .diff.gz): logilab-devtools_0.25.0-1~rev1244.dsc<br/>20 this build is arch-independent. Lgp will only build on architecture amd64<br/>10 changing build context... (/tmp/tmpz7hkjs)<br/>10 package builder flavour: &#39;pbuilder&#39;<br/>20 building binary debian package for &#39;jessie/amd64&#39; using DEBBUILDOPTS options: &#39;(none)&#39; ...<br/>10 running build command: sudo IMAGE=/var/cache/lgp/buildd/jessie-amd64.tgz DIST=jessie ARCH=amd64 pbuilder build --configfile /etc/lgp/pbuilderrc --buildresult /tmp/tmpz7hkjs --hookdir /var/lib/logilab-packaging/hooks /tmp/tmp_EZUJg/logilab-devtools_0.25.0-1~rev1244.dsc ...<br/>50 binary build(s) failed for &#39;jessie&#39; with exit status 1<br/>20 a build logfile is available: /tmp/tmpe4cHQ6/src/jessie/logilab-devtools_0.25.0-1~rev1244_amd64_jessie.lgp-build.log<br/>10 copy pristine tarball to prepare Debian source package diff<br/>10 extracting original source archive for trusty distribution in /tmp/tmp_8Urwn<br/>10 suffix &#39;~rev1244&#39; added to package version<br/>20 Debian source package (format: 3.0 (quilt)) for &#39;trusty&#39;<br/>10 running dpkg-source command: dpkg-source -b /tmp/tmp_8Urwn/logilab-devtools-0.25.0 ...<br/>20 create Debian source package files (.dsc, .diff.gz): logilab-devtools_0.25.0-1~rev1244.dsc<br/>20 this build is arch-independent. Lgp will only build on architecture amd64<br/>10 changing build context... (/tmp/tmpn4275n)<br/>10 package builder flavour: &#39;pbuilder&#39;<br/>20 building binary debian package for &#39;trusty/amd64&#39; using DEBBUILDOPTS options: &#39;(none)&#39; ...<br/>10 running build command: sudo IMAGE=/var/cache/lgp/buildd/trusty-amd64.tgz DIST=trusty ARCH=amd64 pbuilder build --configfile /etc/lgp/pbuilderrc --buildresult /tmp/tmpn4275n --hookdir /var/lib/logilab-packaging/hooks /tmp/tmp_8Urwn/logilab-devtools_0.25.0-1~rev1244.dsc ...<br/>50 binary build(s) failed for &#39;trusty&#39; with exit status 1<br/>20 a build logfile is available: /tmp/tmpe4cHQ6/src/trusty/logilab-devtools_0.25.0-1~rev1244_amd64_trusty.lgp-build.log<br/>10 copy pristine tarball to prepare Debian source package diff<br/>10 extracting original source archive for wheezy distribution in /tmp/tmp4gxFoS<br/>10 suffix &#39;~rev1244&#39; added to package version<br/>20 Debian source package (format: 3.0 (quilt)) for &#39;wheezy&#39;<br/>10 running dpkg-source command: dpkg-source -b /tmp/tmp4gxFoS/logilab-devtools-0.25.0 ...<br/>20 create Debian source package files (.dsc, .diff.gz): logilab-devtools_0.25.0-1~rev1244.dsc<br/>20 this build is arch-independent. Lgp will only build on architecture amd64<br/>10 changing build context... (/tmp/tmpSCcONU)<br/>10 package builder flavour: &#39;pbuilder&#39;<br/>20 building binary debian package for &#39;wheezy/amd64&#39; using DEBBUILDOPTS options: &#39;(none)&#39; ...<br/>10 running build command: sudo IMAGE=/var/cache/lgp/buildd/wheezy-amd64.tgz DIST=wheezy ARCH=amd64 pbuilder build --configfile /etc/lgp/pbuilderrc --buildresult /tmp/tmpSCcONU --hookdir /var/lib/logilab-packaging/hooks /tmp/tmp4gxFoS/logilab-devtools_0.25.0-1~rev1244.dsc ...<br/>50 binary build(s) failed for &#39;wheezy&#39; with exit status 1<br/>20 a build logfile is available: /tmp/tmpe4cHQ6/src/wheezy/logilab-devtools_0.25.0-1~rev1244_amd64_wheezy.lgp-build.log<br/>30 unable to find the &#39;.spec&#39; file<br/>30 please use the &#39;--specfile&#39; option<br/>10 copy pristine tarball to prepare Debian source package diff<br/>10 extracting original source archive for utopic distribution in /tmp/tmpl0bB__<br/>10 suffix &#39;~rev1244&#39; added to package version<br/>20 Debian source package (format: 3.0 (quilt)) for &#39;utopic&#39;<br/>10 running dpkg-source command: dpkg-source -b /tmp/tmpl0bB__/logilab-devtools-0.25.0 ...<br/>20 create Debian source package files (.dsc, .diff.gz): logilab-devtools_0.25.0-1~rev1244.dsc<br/>20 this build is arch-independent. Lgp will only build on architecture amd64<br/>10 changing build context... (/tmp/tmpEQ92OY)<br/>10 package builder flavour: &#39;pbuilder&#39;<br/>20 building binary debian package for &#39;utopic/amd64&#39; using DEBBUILDOPTS options: &#39;(none)&#39; ...<br/>10 running build command: sudo IMAGE=/var/cache/lgp/buildd/utopic-amd64.tgz DIST=utopic ARCH=amd64 pbuilder build --configfile /etc/lgp/pbuilderrc --buildresult /tmp/tmpEQ92OY --hookdir /var/lib/logilab-packaging/hooks /tmp/tmpl0bB__/logilab-devtools_0.25.0-1~rev1244.dsc ...<br/>50 binary build(s) failed for &#39;utopic&#39; with exit status 1<br/>20 a build logfile is available: /tmp/tmpe4cHQ6/src/utopic/logilab-devtools_0.25.0-1~rev1244_amd64_utopic.lgp-build.log<br/>30 unable to find the &#39;.spec&#39; file<br/>30 please use the &#39;--specfile&#39; option<br/>10 copy pristine tarball to prepare Debian source package diff<br/>10 extracting original source archive for sid distribution in /tmp/tmpuXcKE1<br/>10 suffix &#39;~rev1244&#39; added to package version<br/>20 Debian source package (format: 3.0 (quilt)) for &#39;sid&#39;<br/>10 running dpkg-source command: dpkg-source -b /tmp/tmpuXcKE1/logilab-devtools-0.25.0 ...<br/>20 create Debian source package files (.dsc, .diff.gz): logilab-devtools_0.25.0-1~rev1244.dsc<br/>20 this build is arch-independent. Lgp will only build on architecture amd64<br/>10 changing build context... (/tmp/tmpHg7Fa6)<br/>10 package builder flavour: &#39;pbuilder&#39;<br/>20 building binary debian package for &#39;sid/amd64&#39; using DEBBUILDOPTS options: &#39;(none)&#39; ...<br/>10 running build command: sudo IMAGE=/var/cache/lgp/buildd/sid-amd64.tgz DIST=sid ARCH=amd64 pbuilder build --configfile /etc/lgp/pbuilderrc --buildresult /tmp/tmpHg7Fa6 --hookdir /var/lib/logilab-packaging/hooks /tmp/tmpuXcKE1/logilab-devtools_0.25.0-1~rev1244.dsc ...<br/>50 binary build(s) failed for &#39;sid&#39; with exit status 1<br/>20 a build logfile is available: /tmp/tmpe4cHQ6/src/sid/logilab-devtools_0.25.0-1~rev1244_amd64_sid.lgp-build.log<br/>30 unable to find the &#39;.spec&#39; file<br/>30 please use the &#39;--specfile&#39; option<br/>20 recent files from build:
* /tmp/tmpe4cHQ6/src/jessie/logilab-devtools_0.25.0-1~rev1244_amd64_jessie.lgp-build.log
* /tmp/tmpe4cHQ6/src/sid/logilab-devtools_0.25.0-1~rev1244_amd64_sid.lgp-build.log
* /tmp/tmpe4cHQ6/src/trusty/logilab-devtools_0.25.0-1~rev1244_amd64_trusty.lgp-build.log
* /tmp/tmpe4cHQ6/src/utopic/logilab-devtools_0.25.0-1~rev1244_amd64_utopic.lgp-build.log
* /tmp/tmpe4cHQ6/src/wheezy/logilab-devtools_0.25.0-1~rev1244_amd64_wheezy.lgp-build.log<br/>20 begin scanning for log files <br/>20 printing /tmp/tmpe4cHQ6/src/29160/../trusty/logilab-devtools_0.25.0-1~rev1244_amd64_trusty.lgp-build.log: I: Using pkgname logfile

I: Current time: Mon Jun 15 23:02:54 CEST 2015

I: pbuilder-time-stamp: 1434402174

I: Obtaining the cached apt archive contents

I: Installing the build-deps

I: user script /var/cache/pbuilder/build//17270/tmp/hooks/D10tmp starting

I: user script /var/cache/pbuilder/build//17270/tmp/hooks/D10tmp finished

I: user script /var/cache/pbuilder/build//17270/tmp/hooks/D50debconf starting

I: user script /var/cache/pbuilder/build//17270/tmp/hooks/D50debconf finished

I: user script /var/cache/pbuilder/build//17270/tmp/hooks/D99apt starting

+ apt-get update

I: user script /var/cache/pbuilder/build//17270/tmp/hooks/D99apt finished

-&gt; Attempting to satisfy build-dependencies

-&gt; Creating pbuilder-satisfydepends-dummy package

Package: pbuilder-satisfydepends-dummy

Version: 0.invalid.0

Architecture: amd64

Maintainer: Debian Pbuilder Team &lt;pbuilder-maint@lists.alioth.debian.org&gt;

Description: Dummy package to satisfy dependencies with aptitude - created by pbuilder

This package was created automatically by pbuilder to satisfy the

build-dependencies of the package being currently built.

Depends: debhelper (&gt;= 9), python-all (&gt;= 2.6.5), dh-python, python-support

dpkg-deb: building package `pbuilder-satisfydepends-dummy&#39; in `/tmp/satisfydepends-aptitude/pbuilder-satisfydepends-dummy.deb&#39;.

Selecting previously unselected package pbuilder-satisfydepends-dummy.

(Reading database ... 12288 files and directories currently installed.)

Preparing to unpack .../pbuilder-satisfydepends-dummy.deb ...

Unpacking pbuilder-satisfydepends-dummy (0.invalid.0) ...

dpkg: pbuilder-satisfydepends-dummy: dependency problems, but configuring anyway as you requested:

pbuilder-satisfydepends-dummy depends on debhelper (&gt;= 9); however:

Package debhelper is not installed.

pbuilder-satisfydepends-dummy depends on python-all (&gt;= 2.6.5); however:

Package python-all is not installed.

pbuilder-satisfydepends-dummy depends on dh-python; however:

Package dh-python is not installed.

pbuilder-satisfydepends-dummy depends on python-support; however:

Package python-support is not installed.

Setting up pbuilder-satisfydepends-dummy (0.invalid.0) ...

Reading package lists...

Building dependency tree...

Reading state information...

Initializing package states...

Writing extended state information...

The following NEW packages will be installed:

bsdmainutils{a} debhelper{a} dh-apparmor{a} dh-python{a} file{a}

gettext{a} gettext-base{a} groff-base{a} intltool-debian{a}

libasprintf0c2{a} libcroco3{a} libexpat1{a} libffi6{a} libglib2.0-0{a}

libmagic1{a} libmpdec2{a} libpipeline1{a} libpython-stdlib{a}

libpython2.7-minimal{a} libpython2.7-stdlib{a} libpython3-stdlib{a}

libpython3.4-minimal{a} libpython3.4-stdlib{a} libunistring0{a}

libxml2{a} man-db{a} mime-support{a} po-debconf{a} python{a}

python-all{a} python-minimal{a} python-support{a} python2.7{a}

python2.7-minimal{a} python3{a} python3-minimal{a} python3.4{a}

python3.4-minimal{a}

0 packages upgraded, 38 newly installed, 0 to remove and 4 not upgraded.

Need to get 39.0 kB/14.0 MB of archives. After unpacking 57.4 MB will be used.

Writing extended state information...

Get: 1 http://archive.ubuntu.com/ubuntu/ trusty-updates/main dh-apparmor all 2.8.95~2430-0ubuntu5.2 [12.3 kB]

Get: 2 http://archive.ubuntu.com/ubuntu/ trusty/universe python-support all 1.0.15 [26.7 kB]

Fetched 39.0 kB in 0s (110 kB/s)

Extracting templates from packages: 78%
Extracting templates from packages: 100%

Preconfiguring packages ...

Selecting previously unselected package libexpat1:amd64.

(Reading database ... 12288 files and directories currently installed.)

Preparing to unpack .../libexpat1_2.1.0-4ubuntu1_amd64.deb ...

Unpacking libexpat1:amd64 (2.1.0-4ubuntu1) ...

Selecting previously unselected package libffi6:amd64.

Preparing to unpack .../libffi6_3.1~rc1+r3.0.13-12_amd64.deb ...

Unpacking libffi6:amd64 (3.1~rc1+r3.0.13-12) ...

Selecting previously unselected package libmagic1:amd64.

Preparing to unpack .../libmagic1_1%3a5.14-2ubuntu3.3_amd64.deb ...

Unpacking libmagic1:amd64 (1:5.14-2ubuntu3.3) ...

Selecting previously unselected package libmpdec2:amd64.

Preparing to unpack .../libmpdec2_2.4.0-6_amd64.deb ...

Unpacking libmpdec2:amd64 (2.4.0-6) ...

Selecting previously unselected package libpython3.4-minimal:amd64.

Preparing to unpack .../libpython3.4-minimal_3.4.0-2ubuntu1_amd64.deb ...

Unpacking libpython3.4-minimal:amd64 (3.4.0-2ubuntu1) ...

Selecting previously unselected package mime-support.

Preparing to unpack .../mime-support_3.54ubuntu1.1_all.deb ...

Unpacking mime-support (3.54ubuntu1.1) ...

Selecting previously unselected package libpython3.4-stdlib:amd64.

Preparing to unpack .../libpython3.4-stdlib_3.4.0-2ubuntu1_amd64.deb ...

Unpacking libpython3.4-stdlib:amd64 (3.4.0-2ubuntu1) ...

Selecting previously unselected package python3.4-minimal.

Preparing to unpack .../python3.4-minimal_3.4.0-2ubuntu1_amd64.deb ...

Unpacking python3.4-minimal (3.4.0-2ubuntu1) ...

Selecting previously unselected package libasprintf0c2:amd64.

Preparing to unpack .../libasprintf0c2_0.18.3.1-1ubuntu3_amd64.deb ...

Unpacking libasprintf0c2:amd64 (0.18.3.1-1ubuntu3) ...

Selecting previously unselected package libglib2.0-0:amd64.

Preparing to unpack .../libglib2.0-0_2.40.2-0ubuntu1_amd64.deb ...

Unpacking libglib2.0-0:amd64 (2.40.2-0ubuntu1) ...

Selecting previously unselected package libpipeline1:amd64.

Preparing to unpack .../libpipeline1_1.3.0-1_amd64.deb ...

Unpacking libpipeline1:amd64 (1.3.0-1) ...

Selecting previously unselected package libxml2:amd64.

Preparing to unpack .../libxml2_2.9.1+dfsg1-3ubuntu4.4_amd64.deb ...

Unpacking libxml2:amd64 (2.9.1+dfsg1-3ubuntu4.4) ...

Selecting previously unselected package groff-base.

Preparing to unpack .../groff-base_1.22.2-5_amd64.deb ...

Unpacking groff-base (1.22.2-5) ...

Selecting previously unselected package bsdmainutils.

Preparing to unpack .../bsdmainutils_9.0.5ubuntu1_amd64.deb ...

Unpacking bsdmainutils (9.0.5ubuntu1) ...

Selecting previously unselected package man-db.

Preparing to unpack .../man-db_2.6.7.1-1ubuntu1_amd64.deb ...

Unpacking man-db (2.6.7.1-1ubuntu1) ...

Selecting previously unselected package libcroco3:amd64.

Preparing to unpack .../libcroco3_0.6.8-2ubuntu1_amd64.deb ...

Unpacking libcroco3:amd64 (0.6.8-2ubuntu1) ...

Selecting previously unselected package libunistring0:amd64.

Preparing to unpack .../libunistring0_0.9.3-5ubuntu3_amd64.deb ...

Unpacking libunistring0:amd64 (0.9.3-5ubuntu3) ...

Selecting previously unselected package libpython2.7-minimal:amd64.

Preparing to unpack .../libpython2.7-minimal_2.7.6-8_amd64.deb ...

Unpacking libpython2.7-minimal:amd64 (2.7.6-8) ...

Selecting previously unselected package python2.7-minimal.

Preparing to unpack .../python2.7-minimal_2.7.6-8_amd64.deb ...

Unpacking python2.7-minimal (2.7.6-8) ...

Selecting previously unselected package python3.4.

Preparing to unpack .../python3.4_3.4.0-2ubuntu1_amd64.deb ...

Unpacking python3.4 (3.4.0-2ubuntu1) ...

Selecting previously unselected package python3-minimal.

Preparing to unpack .../python3-minimal_3.4.0-0ubuntu2_amd64.deb ...

Unpacking python3-minimal (3.4.0-0ubuntu2) ...

Selecting previously unselected package libpython3-stdlib:amd64.

Preparing to unpack .../libpython3-stdlib_3.4.0-0ubuntu2_amd64.deb ...

Unpacking libpython3-stdlib:amd64 (3.4.0-0ubuntu2) ...

Selecting previously unselected package python3.

Preparing to unpack .../python3_3.4.0-0ubuntu2_amd64.deb ...

Unpacking python3 (3.4.0-0ubuntu2) ...

Selecting previously unselected package dh-python.

Preparing to unpack .../dh-python_1.20140128-1ubuntu8_all.deb ...

Unpacking dh-python (1.20140128-1ubuntu8) ...

Selecting previously unselected package file.

Preparing to unpack .../file_1%3a5.14-2ubuntu3.3_amd64.deb ...

Unpacking file (1:5.14-2ubuntu3.3) ...

Selecting previously unselected package gettext-base.

Preparing to unpack .../gettext-base_0.18.3.1-1ubuntu3_amd64.deb ...

Unpacking gettext-base (0.18.3.1-1ubuntu3) ...

Selecting previously unselected package gettext.

Preparing to unpack .../gettext_0.18.3.1-1ubuntu3_amd64.deb ...

Unpacking gettext (0.18.3.1-1ubuntu3) ...

Selecting previously unselected package intltool-debian.

Preparing to unpack .../intltool-debian_0.35.0+20060710.1_all.deb ...

Unpacking intltool-debian (0.35.0+20060710.1) ...

Selecting previously unselected package po-debconf.

Preparing to unpack .../po-debconf_1.0.16+nmu2ubuntu1_all.deb ...

Unpacking po-debconf (1.0.16+nmu2ubuntu1) ...

Selecting previously unselected package dh-apparmor.

Preparing to unpack .../dh-apparmor_2.8.95~2430-0ubuntu5.2_all.deb ...

Unpacking dh-apparmor (2.8.95~2430-0ubuntu5.2) ...

Selecting previously unselected package debhelper.

Preparing to unpack .../debhelper_9.20131227ubuntu1_all.deb ...

Unpacking debhelper (9.20131227ubuntu1) ...

Selecting previously unselected package libpython2.7-stdlib:amd64.

Preparing to unpack .../libpython2.7-stdlib_2.7.6-8_amd64.deb ...

Unpacking libpython2.7-stdlib:amd64 (2.7.6-8) ...

Selecting previously unselected package libpython-stdlib:amd64.

Preparing to unpack .../libpython-stdlib_2.7.5-5ubuntu3_amd64.deb ...

Unpacking libpython-stdlib:amd64 (2.7.5-5ubuntu3) ...

Selecting previously unselected package python2.7.

Preparing to unpack .../python2.7_2.7.6-8_amd64.deb ...

Unpacking python2.7 (2.7.6-8) ...

Selecting previously unselected package python-minimal.

Preparing to unpack .../python-minimal_2.7.5-5ubuntu3_amd64.deb ...

Unpacking python-minimal (2.7.5-5ubuntu3) ...

Selecting previously unselected package python.

Preparing to unpack .../python_2.7.5-5ubuntu3_amd64.deb ...

Unpacking python (2.7.5-5ubuntu3) ...

Selecting previously unselected package python-all.

Preparing to unpack .../python-all_2.7.5-5ubuntu3_amd64.deb ...

Unpacking python-all (2.7.5-5ubuntu3) ...

Selecting previously unselected package python-support.

Preparing to unpack .../python-support_1.0.15_all.deb ...

Unpacking python-support (1.0.15) ...

Setting up libexpat1:amd64 (2.1.0-4ubuntu1) ...

Setting up libffi6:amd64 (3.1~rc1+r3.0.13-12) ...

Setting up libmagic1:amd64 (1:5.14-2ubuntu3.3) ...

Setting up libmpdec2:amd64 (2.4.0-6) ...

Setting up libpython3.4-minimal:amd64 (3.4.0-2ubuntu1) ...

Setting up mime-support (3.54ubuntu1.1) ...

update-alternatives: using /usr/bin/see to provide /usr/bin/view (view) in auto mode

Setting up libpython3.4-stdlib:amd64 (3.4.0-2ubuntu1) ...

Setting up python3.4-minimal (3.4.0-2ubuntu1) ...

Setting up libasprintf0c2:amd64 (0.18.3.1-1ubuntu3) ...

Setting up libglib2.0-0:amd64 (2.40.2-0ubuntu1) ...

No schema files found: doing nothing.

Setting up libpipeline1:amd64 (1.3.0-1) ...

Setting up libxml2:amd64 (2.9.1+dfsg1-3ubuntu4.4) ...

Setting up groff-base (1.22.2-5) ...

Setting up bsdmainutils (9.0.5ubuntu1) ...

update-alternatives: using /usr/bin/bsd-write to provide /usr/bin/write (write) in auto mode

update-alternatives: using /usr/bin/bsd-from to provide /usr/bin/from (from) in auto mode

Setting up man-db (2.6.7.1-1ubuntu1) ...

Not building database; man-db/auto-update is not &#39;true&#39;.

Setting up libcroco3:amd64 (0.6.8-2ubuntu1) ...

Setting up libunistring0:amd64 (0.9.3-5ubuntu3) ...

Setting up libpython2.7-minimal:amd64 (2.7.6-8) ...

Setting up python2.7-minimal (2.7.6-8) ...

Setting up python3.4 (3.4.0-2ubuntu1) ...

Setting up python3-minimal (3.4.0-0ubuntu2) ...

Setting up libpython3-stdlib:amd64 (3.4.0-0ubuntu2) ...

Setting up file (1:5.14-2ubuntu3.3) ...

Setting up gettext-base (0.18.3.1-1ubuntu3) ...

Setting up gettext (0.18.3.1-1ubuntu3) ...

Setting up intltool-debian (0.35.0+20060710.1) ...

Setting up po-debconf (1.0.16+nmu2ubuntu1) ...

Setting up dh-apparmor (2.8.95~2430-0ubuntu5.2) ...

Setting up debhelper (9.20131227ubuntu1) ...

Setting up libpython2.7-stdlib:amd64 (2.7.6-8) ...

Setting up libpython-stdlib:amd64 (2.7.5-5ubuntu3) ...

Setting up python2.7 (2.7.6-8) ...

Setting up python-minimal (2.7.5-5ubuntu3) ...

Setting up python (2.7.5-5ubuntu3) ...

Setting up python-all (2.7.5-5ubuntu3) ...

Setting up python-support (1.0.15) ...

Setting up python3 (3.4.0-0ubuntu2) ...

Setting up dh-python (1.20140128-1ubuntu8) ...

Processing triggers for libc-bin (2.19-0ubuntu6.6) ...

Reading package lists...

Building dependency tree...

Reading state information...

Reading extended state information...

Initializing package states...

Writing extended state information...

-&gt; Finished parsing the build-deps

Reading package lists...

Building dependency tree...

Reading state information...

apt-utils is already the newest version.

The following NEW packages will be installed:

fakeroot libfakeroot

0 upgraded, 2 newly installed, 0 to remove and 4 not upgraded.

Need to get 0 B/80.4 kB of archives.

After this operation, 415 kB of additional disk space will be used.

Selecting previously unselected package libfakeroot:amd64.

(Reading database ... 15293 files and directories currently installed.)

Preparing to unpack .../libfakeroot_1.20-3ubuntu2_amd64.deb ...

Unpacking libfakeroot:amd64 (1.20-3ubuntu2) ...

Selecting previously unselected package fakeroot.

Preparing to unpack .../fakeroot_1.20-3ubuntu2_amd64.deb ...

Unpacking fakeroot (1.20-3ubuntu2) ...

Processing triggers for man-db (2.6.7.1-1ubuntu1) ...

Not building database; man-db/auto-update is not &#39;true&#39;.

Setting up libfakeroot:amd64 (1.20-3ubuntu2) ...

Setting up fakeroot (1.20-3ubuntu2) ...

update-alternatives: using /usr/bin/fakeroot-sysv to provide /usr/bin/fakeroot (fakeroot) in auto mode

I: Copying back the cached apt archive contents

I: new cache content dh-apparmor_2.8.95~2430-0ubuntu5.2_all.deb added

I: new cache content python-support_1.0.15_all.deb added

I: Copying source file

I: copying [/tmp/tmp_8Urwn/logilab-devtools_0.25.0-1~rev1244.dsc]

I: copying [/tmp/tmp_8Urwn/logilab-devtools_0.25.0.orig.tar.gz]

I: copying [/tmp/tmp_8Urwn/logilab-devtools_0.25.0-1~rev1244.debian.tar.xz]

I: Extracting source

dpkg-source: warning: extracting unsigned source package (logilab-devtools_0.25.0-1~rev1244.dsc)

dpkg-source: info: extracting logilab-devtools in logilab-devtools-0.25.0

dpkg-source: info: unpacking logilab-devtools_0.25.0.orig.tar.gz

dpkg-source: info: unpacking logilab-devtools_0.25.0-1~rev1244.debian.tar.xz

I: Building the package

W: no hooks of type A found -- ignoring

I: Running cd tmp/buildd/*/ &amp;&amp; env PATH=&quot;/usr/sbin:/usr/bin:/sbin:/bin&quot; dpkg-buildpackage -us -uc -rfakeroot

dpkg-buildpackage: source package logilab-devtools

dpkg-buildpackage: source version 0.25.0-1~rev1244

dpkg-buildpackage: source distribution trusty

dpkg-buildpackage: source changed by David Douard &lt;david.douard@logilab.fr&gt;

dpkg-source --before-build logilab-devtools-0.25.0

dpkg-buildpackage: host architecture amd64

fakeroot debian/rules clean

dh clean --with python2 --buildsystem=pybuild

dh_testdir -O--buildsystem=pybuild

dh_auto_clean -O--buildsystem=pybuild

I: pybuild base:170: python2.7 setup.py clean

Traceback (most recent call last):

File &quot;setup.py&quot;, line 25, in &lt;module&gt;

from setuptools import setup, find_packages

ImportError: No module named setuptools

E: pybuild pybuild:256: clean: plugin distutils failed with: exit code=1: python2.7 setup.py clean

dh_auto_clean: pybuild --clean -i python{version} -p 2.7 --dir . returned exit code 13

make: *** [clean] Error 13

dpkg-buildpackage: error: fakeroot debian/rules clean gave error exit status 2

E: Failed autobuilding of package

I: user script /var/cache/pbuilder/build//17270/tmp/hooks/C10shell starting

[1;32mC10shell: You&#39;re entering into the image used to build the package,

because LGP_AUTO_ENTER_SHELL has been found in environment. [0;0m

TMOUT set to 1200 seconds.

Type exit or Ctrl-D (i.e. EOF) to escape.

/tmp/hooks/C10shell: line 20: /dev/tty: No such device or address

I: unmounting /sys filesystem

I: unmounting /dev filesystem

W: Could not unmount /dev: umount: /var/cache/pbuilder/build//17270//dev: target is busy

(In some cases useful info about processes that

use the device is found by lsof(8) or fuser(1).)

W: Retrying to unmount /dev in 5s

umount: /var/cache/pbuilder/build//17270//dev: target is busy

(In some cases useful info about processes that

use the device is found by lsof(8) or fuser(1).)

Not building database; man-db/auto-update is not &#39;true&#39;.

Could not unmount /dev, some programs might

still be using files in /proc (klogd?).

Please check and kill these processes manually

so that I can unmount /dev. Last umount error was:

umount: /var/cache/pbuilder/build//17270//dev: target is busy

(In some cases useful info about processes that

use the device is found by lsof(8) or fuser(1).)

This error only affects chroots; you may want to use

user-mode-linux to avoid this message.

I: unmounting dev/pts filesystem

I: unmounting run/shm filesystem

I: unmounting proc filesystem

I: cleaning the build env

I: removing directory /var/cache/pbuilder/build//17270 and its subdirectories
<br/>20 printing /tmp/tmpe4cHQ6/src/29160/../sid/logilab-devtools_0.25.0-1~rev1244_amd64_sid.lgp-build.log: I: Using pkgname logfile

I: Current time: Mon Jun 15 23:04:30 CEST 2015

I: pbuilder-time-stamp: 1434402270

I: Obtaining the cached apt archive contents

I: Installing the build-deps

I: user script /var/cache/pbuilder/build//21393/tmp/hooks/D10tmp starting

I: user script /var/cache/pbuilder/build//21393/tmp/hooks/D10tmp finished

I: user script /var/cache/pbuilder/build//21393/tmp/hooks/D50debconf starting

I: user script /var/cache/pbuilder/build//21393/tmp/hooks/D50debconf finished

I: user script /var/cache/pbuilder/build//21393/tmp/hooks/D99apt starting

+ apt-get update

I: user script /var/cache/pbuilder/build//21393/tmp/hooks/D99apt finished

-&gt; Attempting to satisfy build-dependencies

-&gt; Creating pbuilder-satisfydepends-dummy package

Package: pbuilder-satisfydepends-dummy

Version: 0.invalid.0

Architecture: amd64

Maintainer: Debian Pbuilder Team &lt;pbuilder-maint@lists.alioth.debian.org&gt;

Description: Dummy package to satisfy dependencies with aptitude - created by pbuilder

This package was created automatically by pbuilder to satisfy the

build-dependencies of the package being currently built.

Depends: debhelper (&gt;= 9), python-all (&gt;= 2.6.5), dh-python, python-support

dpkg-deb: building package &#39;pbuilder-satisfydepends-dummy&#39; in &#39;/tmp/satisfydepends-aptitude/pbuilder-satisfydepends-dummy.deb&#39;.

Selecting previously unselected package pbuilder-satisfydepends-dummy.

(Reading database ... 12397 files and directories currently installed.)

Preparing to unpack .../pbuilder-satisfydepends-dummy.deb ...

Unpacking pbuilder-satisfydepends-dummy (0.invalid.0) ...

dpkg: pbuilder-satisfydepends-dummy: dependency problems, but configuring anyway as you requested:

pbuilder-satisfydepends-dummy depends on debhelper (&gt;= 9); however:

Package debhelper is not installed.

pbuilder-satisfydepends-dummy depends on python-all (&gt;= 2.6.5); however:

Package python-all is not installed.

pbuilder-satisfydepends-dummy depends on dh-python; however:

Package dh-python is not installed.

pbuilder-satisfydepends-dummy depends on python-support; however:

Package python-support is not installed.

Setting up pbuilder-satisfydepends-dummy (0.invalid.0) ...

Reading package lists...

Building dependency tree...

Reading state information...

Initializing package states...

Writing extended state information...

Building tag database...

The following NEW packages will be installed:

bsdmainutils{a} debhelper{a} dh-python{a} file{a} gettext{a}

gettext-base{a} groff-base{a} intltool-debian{a} libasprintf0c2{a}

libcroco3{a} libexpat1{a} libglib2.0-0{a} libmagic1{a} libmpdec2{a}

libpipeline1{a} libpython-stdlib{a} libpython2.7-minimal{a}

libpython2.7-stdlib{a} libpython3-stdlib{a} libpython3.4-minimal{a}

libpython3.4-stdlib{a} libunistring0{a} libxml2{a} man-db{a}

mime-support{a} po-debconf{a} python{a} python-all{a} python-minimal{a}

python-support{a} python2.7{a} python2.7-minimal{a} python3{a}

python3-minimal{a} python3.4{a} python3.4-minimal{a}

0 packages upgraded, 36 newly installed, 0 to remove and 0 not upgraded.

Need to get 0 B/17.7 MB of archives. After unpacking 68.0 MB will be used.

Writing extended state information...

Extracting templates from packages: 83%
Extracting templates from packages: 100%

Preconfiguring packages ...

E: Can not write log (Is /dev/pts mounted?) - posix_openpt (2: No such file or directory)

Selecting previously unselected package libpipeline1:amd64.

(Reading database ... 12397 files and directories currently installed.)

Preparing to unpack .../libpipeline1_1.4.0-1_amd64.deb ...

Unpacking libpipeline1:amd64 (1.4.0-1) ...

Selecting previously unselected package groff-base.

Preparing to unpack .../groff-base_1.22.3-1_amd64.deb ...

Unpacking groff-base (1.22.3-1) ...

Selecting previously unselected package bsdmainutils.

Preparing to unpack .../bsdmainutils_9.0.6_amd64.deb ...

Unpacking bsdmainutils (9.0.6) ...

Selecting previously unselected package man-db.

Preparing to unpack .../man-db_2.7.0.2-5_amd64.deb ...

Unpacking man-db (2.7.0.2-5) ...

Selecting previously unselected package libasprintf0c2:amd64.

Preparing to unpack .../libasprintf0c2_0.19.4-1_amd64.deb ...

Unpacking libasprintf0c2:amd64 (0.19.4-1) ...

Selecting previously unselected package libmagic1:amd64.

Preparing to unpack .../libmagic1_1%3a5.22+15-2_amd64.deb ...

Unpacking libmagic1:amd64 (1:5.22+15-2) ...

Selecting previously unselected package libxml2:amd64.

Preparing to unpack .../libxml2_2.9.2+dfsg1-3_amd64.deb ...

Unpacking libxml2:amd64 (2.9.2+dfsg1-3) ...

Selecting previously unselected package libpython2.7-minimal:amd64.

Preparing to unpack .../libpython2.7-minimal_2.7.10-2_amd64.deb ...

Unpacking libpython2.7-minimal:amd64 (2.7.10-2) ...

Selecting previously unselected package python2.7-minimal.

Preparing to unpack .../python2.7-minimal_2.7.10-2_amd64.deb ...

Unpacking python2.7-minimal (2.7.10-2) ...

Selecting previously unselected package python-minimal.

Preparing to unpack .../python-minimal_2.7.9-1_amd64.deb ...

Unpacking python-minimal (2.7.9-1) ...

Selecting previously unselected package mime-support.

Preparing to unpack .../mime-support_3.58_all.deb ...

Unpacking mime-support (3.58) ...

Selecting previously unselected package libexpat1:amd64.

Preparing to unpack .../libexpat1_2.1.0-6+b3_amd64.deb ...

Unpacking libexpat1:amd64 (2.1.0-6+b3) ...

Selecting previously unselected package libpython2.7-stdlib:amd64.

Preparing to unpack .../libpython2.7-stdlib_2.7.10-2_amd64.deb ...

Unpacking libpython2.7-stdlib:amd64 (2.7.10-2) ...

Selecting previously unselected package python2.7.

Preparing to unpack .../python2.7_2.7.10-2_amd64.deb ...

Unpacking python2.7 (2.7.10-2) ...

Selecting previously unselected package libpython-stdlib:amd64.

Preparing to unpack .../libpython-stdlib_2.7.9-1_amd64.deb ...

Unpacking libpython-stdlib:amd64 (2.7.9-1) ...

Setting up libpython2.7-minimal:amd64 (2.7.10-2) ...

Setting up python2.7-minimal (2.7.10-2) ...

Setting up python-minimal (2.7.9-1) ...

Selecting previously unselected package python.

(Reading database ... 13766 files and directories currently installed.)

Preparing to unpack .../python_2.7.9-1_amd64.deb ...

Unpacking python (2.7.9-1) ...

Selecting previously unselected package libglib2.0-0:amd64.

Preparing to unpack .../libglib2.0-0_2.44.1-1_amd64.deb ...

Unpacking libglib2.0-0:amd64 (2.44.1-1) ...

Selecting previously unselected package libcroco3:amd64.

Preparing to unpack .../libcroco3_0.6.8-3+b1_amd64.deb ...

Unpacking libcroco3:amd64 (0.6.8-3+b1) ...

Selecting previously unselected package libmpdec2:amd64.

Preparing to unpack .../libmpdec2_2.4.1-1_amd64.deb ...

Unpacking libmpdec2:amd64 (2.4.1-1) ...

Selecting previously unselected package libpython3.4-minimal:amd64.

Preparing to unpack .../libpython3.4-minimal_3.4.3-7_amd64.deb ...

Unpacking libpython3.4-minimal:amd64 (3.4.3-7) ...

Selecting previously unselected package libpython3.4-stdlib:amd64.

Preparing to unpack .../libpython3.4-stdlib_3.4.3-7_amd64.deb ...

Unpacking libpython3.4-stdlib:amd64 (3.4.3-7) ...

Selecting previously unselected package libunistring0:amd64.

Preparing to unpack .../libunistring0_0.9.3-5.2+b1_amd64.deb ...

Unpacking libunistring0:amd64 (0.9.3-5.2+b1) ...

Selecting previously unselected package python3.4-minimal.

Preparing to unpack .../python3.4-minimal_3.4.3-7_amd64.deb ...

Unpacking python3.4-minimal (3.4.3-7) ...

Selecting previously unselected package file.

Preparing to unpack .../file_1%3a5.22+15-2_amd64.deb ...

Unpacking file (1:5.22+15-2) ...

Selecting previously unselected package gettext-base.

Preparing to unpack .../gettext-base_0.19.4-1_amd64.deb ...

Unpacking gettext-base (0.19.4-1) ...

Selecting previously unselected package python-support.

Preparing to unpack .../python-support_1.0.15_all.deb ...

Unpacking python-support (1.0.15) ...

Selecting previously unselected package gettext.

Preparing to unpack .../gettext_0.19.4-1_amd64.deb ...

Unpacking gettext (0.19.4-1) ...

Selecting previously unselected package intltool-debian.

Preparing to unpack .../intltool-debian_0.35.0+20060710.2_all.deb ...

Unpacking intltool-debian (0.35.0+20060710.2) ...

Selecting previously unselected package po-debconf.

Preparing to unpack .../po-debconf_1.0.18_all.deb ...

Unpacking po-debconf (1.0.18) ...

Selecting previously unselected package debhelper.

Preparing to unpack .../debhelper_9.20150507_all.deb ...

Unpacking debhelper (9.20150507) ...

Selecting previously unselected package python3.4.

Preparing to unpack .../python3.4_3.4.3-7_amd64.deb ...

Unpacking python3.4 (3.4.3-7) ...

Selecting previously unselected package python3-minimal.

Preparing to unpack .../python3-minimal_3.4.2-2_amd64.deb ...

Unpacking python3-minimal (3.4.2-2) ...

Selecting previously unselected package libpython3-stdlib:amd64.

Preparing to unpack .../libpython3-stdlib_3.4.2-2_amd64.deb ...

Unpacking libpython3-stdlib:amd64 (3.4.2-2) ...

Selecting previously unselected package python3.

Preparing to unpack .../python3_3.4.2-2_amd64.deb ...

Unpacking python3 (3.4.2-2) ...

Selecting previously unselected package dh-python.

Preparing to unpack .../dh-python_1.20141111-2_all.deb ...

Unpacking dh-python (1.20141111-2) ...

Selecting previously unselected package python-all.

Preparing to unpack .../python-all_2.7.9-1_amd64.deb ...

Unpacking python-all (2.7.9-1) ...

Setting up libpipeline1:amd64 (1.4.0-1) ...

Setting up groff-base (1.22.3-1) ...

Setting up bsdmainutils (9.0.6) ...

update-alternatives: using /usr/bin/bsd-write to provide /usr/bin/write (write) in auto mode

update-alternatives: using /usr/bin/bsd-from to provide /usr/bin/from (from) in auto mode

Setting up man-db (2.7.0.2-5) ...

Not building database; man-db/auto-update is not &#39;true&#39;.

Setting up libasprintf0c2:amd64 (0.19.4-1) ...

Setting up libmagic1:amd64 (1:5.22+15-2) ...

Setting up libxml2:amd64 (2.9.2+dfsg1-3) ...

Setting up mime-support (3.58) ...

Setting up libexpat1:amd64 (2.1.0-6+b3) ...

Setting up libpython2.7-stdlib:amd64 (2.7.10-2) ...

Setting up python2.7 (2.7.10-2) ...

Setting up libpython-stdlib:amd64 (2.7.9-1) ...

Setting up python (2.7.9-1) ...

Setting up libglib2.0-0:amd64 (2.44.1-1) ...

No schema files found: doing nothing.

Setting up libcroco3:amd64 (0.6.8-3+b1) ...

Setting up libmpdec2:amd64 (2.4.1-1) ...

Setting up libpython3.4-minimal:amd64 (3.4.3-7) ...

Setting up libpython3.4-stdlib:amd64 (3.4.3-7) ...

Setting up libunistring0:amd64 (0.9.3-5.2+b1) ...

Setting up python3.4-minimal (3.4.3-7) ...

Setting up file (1:5.22+15-2) ...

Setting up gettext-base (0.19.4-1) ...

Setting up python-support (1.0.15) ...

Setting up gettext (0.19.4-1) ...

Setting up intltool-debian (0.35.0+20060710.2) ...

Setting up po-debconf (1.0.18) ...

Setting up debhelper (9.20150507) ...

Setting up python3.4 (3.4.3-7) ...

Setting up python3-minimal (3.4.2-2) ...

Setting up libpython3-stdlib:amd64 (3.4.2-2) ...

Setting up python-all (2.7.9-1) ...

Setting up dh-python (1.20141111-2) ...

Setting up python3 (3.4.2-2) ...

Processing triggers for libc-bin (2.19-18) ...

Reading package lists...

Building dependency tree...

Reading state information...

Reading extended state information...

Initializing package states...

Writing extended state information...

Building tag database...

-&gt; Finished parsing the build-deps

Reading package lists...

Building dependency tree...

Reading state information...

apt-utils is already the newest version.

The following NEW packages will be installed:

fakeroot libfakeroot

0 upgraded, 2 newly installed, 0 to remove and 0 not upgraded.

Need to get 0 B/129 kB of archives.

After this operation, 434 kB of additional disk space will be used.

E: Can not write log (Is /dev/pts mounted?) - posix_openpt (2: No such file or directory)

Selecting previously unselected package libfakeroot:amd64.

(Reading database ... 15627 files and directories currently installed.)

Preparing to unpack .../libfakeroot_1.20.2-1_amd64.deb ...

Unpacking libfakeroot:amd64 (1.20.2-1) ...

Selecting previously unselected package fakeroot.

Preparing to unpack .../fakeroot_1.20.2-1_amd64.deb ...

Unpacking fakeroot (1.20.2-1) ...

Processing triggers for man-db (2.7.0.2-5) ...

Not building database; man-db/auto-update is not &#39;true&#39;.

Setting up libfakeroot:amd64 (1.20.2-1) ...

Setting up fakeroot (1.20.2-1) ...

update-alternatives: using /usr/bin/fakeroot-sysv to provide /usr/bin/fakeroot (fakeroot) in auto mode

I: Copying back the cached apt archive contents

I: Copying source file

I: copying [/tmp/tmpuXcKE1/logilab-devtools_0.25.0-1~rev1244.dsc]

I: copying [/tmp/tmpuXcKE1/logilab-devtools_0.25.0.orig.tar.gz]

I: copying [/tmp/tmpuXcKE1/logilab-devtools_0.25.0-1~rev1244.debian.tar.xz]

I: Extracting source

dpkg-source: warning: extracting unsigned source package (logilab-devtools_0.25.0-1~rev1244.dsc)

dpkg-source: info: extracting logilab-devtools in logilab-devtools-0.25.0

dpkg-source: info: unpacking logilab-devtools_0.25.0.orig.tar.gz

dpkg-source: info: unpacking logilab-devtools_0.25.0-1~rev1244.debian.tar.xz

I: Building the package

W: no hooks of type A found -- ignoring

I: Running cd tmp/buildd/*/ &amp;&amp; env PATH=&quot;/usr/sbin:/usr/bin:/sbin:/bin&quot; dpkg-buildpackage -us -uc -rfakeroot

dpkg-buildpackage: source package logilab-devtools

dpkg-buildpackage: source version 0.25.0-1~rev1244

dpkg-buildpackage: source distribution sid

dpkg-buildpackage: source changed by David Douard &lt;david.douard@logilab.fr&gt;

dpkg-source --before-build logilab-devtools-0.25.0

dpkg-buildpackage: host architecture amd64

fakeroot debian/rules clean

dh clean --with python2 --buildsystem=pybuild

dh_testdir -O--buildsystem=pybuild

dh_auto_clean -O--buildsystem=pybuild

I: pybuild base:170: python2.7 setup.py clean

Traceback (most recent call last):

File &quot;setup.py&quot;, line 25, in &lt;module&gt;

from setuptools import setup, find_packages

ImportError: No module named setuptools

E: pybuild pybuild:256: clean: plugin distutils failed with: exit code=1: python2.7 setup.py clean

dh_auto_clean: pybuild --clean -i python{version} -p 2.7 --dir . returned exit code 13

debian/rules:15: recipe for target &#39;clean&#39; failed

make: *** [clean] Error 13

dpkg-buildpackage: error: fakeroot debian/rules clean gave error exit status 2

E: Failed autobuilding of package

I: user script /var/cache/pbuilder/build//21393/tmp/hooks/C10shell starting

[1;32mC10shell: You&#39;re entering into the image used to build the package,

because LGP_AUTO_ENTER_SHELL has been found in environment. [0;0m

TMOUT set to 1200 seconds.

Type exit or Ctrl-D (i.e. EOF) to escape.

/tmp/hooks/C10shell: line 20: /dev/tty: No such device or address

I: unmounting /sys filesystem

I: unmounting /dev filesystem

W: Could not unmount /dev: umount: /var/cache/pbuilder/build//21393//dev: target is busy

(In some cases useful info about processes that

use the device is found by lsof(8) or fuser(1).)

W: Retrying to unmount /dev in 5s

E: Can not write log (Is /dev/pts mounted?) - posix_openpt (2: No such file or directory)

Not building database; man-db/auto-update is not &#39;true&#39;.

I: unmounting dev/pts filesystem

I: unmounting run/shm filesystem

I: unmounting proc filesystem

I: cleaning the build env

I: removing directory /var/cache/pbuilder/build//21393 and its subdirectories
<br/>20 printing /tmp/tmpe4cHQ6/src/29160/../wheezy/logilab-devtools_0.25.0-1~rev1244_amd64_wheezy.lgp-build.log: I: Using pkgname logfile

I: Current time: Mon Jun 15 23:03:30 CEST 2015

I: pbuilder-time-stamp: 1434402210

I: Obtaining the cached apt archive contents

I: Installing the build-deps

I: user script /var/cache/pbuilder/build//18561/tmp/hooks/D10tmp starting

I: user script /var/cache/pbuilder/build//18561/tmp/hooks/D10tmp finished

I: user script /var/cache/pbuilder/build//18561/tmp/hooks/D50debconf starting

I: user script /var/cache/pbuilder/build//18561/tmp/hooks/D50debconf finished

I: user script /var/cache/pbuilder/build//18561/tmp/hooks/D99apt starting

+ apt-get update

I: user script /var/cache/pbuilder/build//18561/tmp/hooks/D99apt finished

-&gt; Attempting to satisfy build-dependencies

-&gt; Creating pbuilder-satisfydepends-dummy package

Package: pbuilder-satisfydepends-dummy

Version: 0.invalid.0

Architecture: amd64

Maintainer: Debian Pbuilder Team &lt;pbuilder-maint@lists.alioth.debian.org&gt;

Description: Dummy package to satisfy dependencies with aptitude - created by pbuilder

This package was created automatically by pbuilder to satisfy the

build-dependencies of the package being currently built.

Depends: debhelper (&gt;= 9), python-all (&gt;= 2.6.5), dh-python, python-support

dpkg-deb: building package `pbuilder-satisfydepends-dummy&#39; in `/tmp/satisfydepends-aptitude/pbuilder-satisfydepends-dummy.deb&#39;.

Selecting previously unselected package pbuilder-satisfydepends-dummy.

(Reading database ... 11689 files and directories currently installed.)

Unpacking pbuilder-satisfydepends-dummy (from .../pbuilder-satisfydepends-dummy.deb) ...

dpkg: pbuilder-satisfydepends-dummy: dependency problems, but configuring anyway as you requested:

pbuilder-satisfydepends-dummy depends on debhelper (&gt;= 9); however:

Package debhelper is not installed.

pbuilder-satisfydepends-dummy depends on python-all (&gt;= 2.6.5); however:

Package python-all is not installed.

pbuilder-satisfydepends-dummy depends on dh-python; however:

Package dh-python is not installed.

pbuilder-satisfydepends-dummy depends on python-support; however:

Package python-support is not installed.

Setting up pbuilder-satisfydepends-dummy (0.invalid.0) ...

Reading package lists...

Building dependency tree...

Reading state information...

Initializing package states...

Writing extended state information...

The following NEW packages will be installed:

bsdmainutils{a} debhelper{a} dh-python{a} file{a} gettext{a}

gettext-base{a} groff-base{a} html2text{a} intltool-debian{a}

libasprintf0c2{a} libcroco3{a} libexpat1{a} libffi5{a} libgettextpo0{a}

libglib2.0-0{a} libmagic1{a} libpcre3{a} libpipeline1{a} libunistring0{a}

libxml2{a} man-db{a} mime-support{a} po-debconf{a} python{a}

python-all{a} python-minimal{a} python-support{a} python2.6{a}

python2.6-minimal{a} python2.7{a} python2.7-minimal{a} python3{a}

python3-minimal{a} python3.2{a} python3.2-minimal{a}

0 packages upgraded, 35 newly installed, 0 to remove and 0 not upgraded.

Need to get 0 B/23.2 MB of archives. After unpacking 70.3 MB will be used.

Writing extended state information...

Extracting templates from packages: 85%
Extracting templates from packages: 100%

Preconfiguring packages ...

Selecting previously unselected package libpipeline1:amd64.

(Reading database ... 11689 files and directories currently installed.)

Unpacking libpipeline1:amd64 (from .../libpipeline1_1.2.1-1_amd64.deb) ...

Selecting previously unselected package libasprintf0c2:amd64.

Unpacking libasprintf0c2:amd64 (from .../libasprintf0c2_0.18.1.1-9_amd64.deb) ...

Selecting previously unselected package libmagic1:amd64.

Unpacking libmagic1:amd64 (from .../libmagic1_5.11-2+deb7u6_amd64.deb) ...

Selecting previously unselected package libpcre3:amd64.

Unpacking libpcre3:amd64 (from .../libpcre3_1%3a8.30-5_amd64.deb) ...

Selecting previously unselected package libxml2:amd64.

Unpacking libxml2:amd64 (from .../libxml2_2.8.0+dfsg1-7+wheezy2_amd64.deb) ...

Selecting previously unselected package libffi5:amd64.

Unpacking libffi5:amd64 (from .../libffi5_3.0.10-3_amd64.deb) ...

Selecting previously unselected package libglib2.0-0:amd64.

Unpacking libglib2.0-0:amd64 (from .../libglib2.0-0_2.33.12+really2.32.4-5_amd64.deb) ...

Selecting previously unselected package libcroco3:amd64.

Unpacking libcroco3:amd64 (from .../libcroco3_0.6.6-2_amd64.deb) ...

Selecting previously unselected package libexpat1:amd64.

Unpacking libexpat1:amd64 (from .../libexpat1_2.1.0-1+deb7u1_amd64.deb) ...

Selecting previously unselected package libunistring0:amd64.

Unpacking libunistring0:amd64 (from .../libunistring0_0.9.3-5_amd64.deb) ...

Selecting previously unselected package libgettextpo0:amd64.

Unpacking libgettextpo0:amd64 (from .../libgettextpo0_0.18.1.1-9_amd64.deb) ...

Selecting previously unselected package bsdmainutils.

Unpacking bsdmainutils (from .../bsdmainutils_9.0.3_amd64.deb) ...

Selecting previously unselected package groff-base.

Unpacking groff-base (from .../groff-base_1.21-9_amd64.deb) ...

Selecting previously unselected package man-db.

Unpacking man-db (from .../man-db_2.6.2-1_amd64.deb) ...

Selecting previously unselected package file.

Unpacking file (from .../file_5.11-2+deb7u6_amd64.deb) ...

Selecting previously unselected package gettext-base.

Unpacking gettext-base (from .../gettext-base_0.18.1.1-9_amd64.deb) ...

Selecting previously unselected package mime-support.

Unpacking mime-support (from .../mime-support_3.52-1+deb7u1_all.deb) ...

Selecting previously unselected package python2.7-minimal.

Unpacking python2.7-minimal (from .../python2.7-minimal_2.7.3-6+deb7u2_amd64.deb) ...

Selecting previously unselected package python2.7.

Unpacking python2.7 (from .../python2.7_2.7.3-6+deb7u2_amd64.deb) ...

Selecting previously unselected package python-minimal.

Unpacking python-minimal (from .../python-minimal_2.7.3-4+deb7u1_all.deb) ...

Selecting previously unselected package python.

Unpacking python (from .../python_2.7.3-4+deb7u1_all.deb) ...

Selecting previously unselected package python-support.

Unpacking python-support (from .../python-support_1.0.15_all.deb) ...

Selecting previously unselected package python2.6-minimal.

Unpacking python2.6-minimal (from .../python2.6-minimal_2.6.8-1.1_amd64.deb) ...

Selecting previously unselected package html2text.

Unpacking html2text (from .../html2text_1.3.2a-15_amd64.deb) ...

Selecting previously unselected package gettext.

Unpacking gettext (from .../gettext_0.18.1.1-9_amd64.deb) ...

Selecting previously unselected package intltool-debian.

Unpacking intltool-debian (from .../intltool-debian_0.35.0+20060710.1_all.deb) ...

Selecting previously unselected package po-debconf.

Unpacking po-debconf (from .../po-debconf_1.0.16+nmu2_all.deb) ...

Selecting previously unselected package debhelper.

Unpacking debhelper (from .../debhelper_9.20120909_all.deb) ...

Selecting previously unselected package python3.2-minimal.

Unpacking python3.2-minimal (from .../python3.2-minimal_3.2.3-7_amd64.deb) ...

Selecting previously unselected package python3.2.

Unpacking python3.2 (from .../python3.2_3.2.3-7_amd64.deb) ...

Selecting previously unselected package python3-minimal.

Unpacking python3-minimal (from .../python3-minimal_3.2.3-6_all.deb) ...

Selecting previously unselected package python3.

Unpacking python3 (from .../python3_3.2.3-6_all.deb) ...

Selecting previously unselected package dh-python.

Unpacking dh-python (from .../dh-python_1.20140511-1~bpo70+1_all.deb) ...

Adding &#39;diversion of /usr/bin/dh_python3 to /usr/bin/dh_python3.real by dh-python&#39;

Adding &#39;diversion of /usr/share/man/man1/dh_python3.1.gz to /usr/share/man/man1/dh_python3.real.1.gz by dh-python&#39;

Adding &#39;diversion of /usr/bin/dh_python2 to /usr/bin/dh_python2.real by dh-python&#39;

Adding &#39;diversion of /usr/share/man/man1/dh_python2.1.gz to /usr/share/man/man1/dh_python2.real.1.gz by dh-python&#39;

Selecting previously unselected package python2.6.

Unpacking python2.6 (from .../python2.6_2.6.8-1.1_amd64.deb) ...

Selecting previously unselected package python-all.

Unpacking python-all (from .../python-all_2.7.3-4+deb7u1_all.deb) ...

Setting up libpipeline1:amd64 (1.2.1-1) ...

Setting up libasprintf0c2:amd64 (0.18.1.1-9) ...

Setting up libmagic1:amd64 (5.11-2+deb7u6) ...

Setting up libpcre3:amd64 (1:8.30-5) ...

Setting up libxml2:amd64 (2.8.0+dfsg1-7+wheezy2) ...

Setting up libffi5:amd64 (3.0.10-3) ...

Setting up libglib2.0-0:amd64 (2.33.12+really2.32.4-5) ...

No schema files found: doing nothing.

Setting up libcroco3:amd64 (0.6.6-2) ...

Setting up libexpat1:amd64 (2.1.0-1+deb7u1) ...

Setting up libunistring0:amd64 (0.9.3-5) ...

Setting up libgettextpo0:amd64 (0.18.1.1-9) ...

Setting up bsdmainutils (9.0.3) ...

update-alternatives: using /usr/bin/bsd-write to provide /usr/bin/write (write) in auto mode

update-alternatives: using /usr/bin/bsd-from to provide /usr/bin/from (from) in auto mode

Setting up groff-base (1.21-9) ...

Setting up man-db (2.6.2-1) ...

Building database of manual pages ...

Setting up file (5.11-2+deb7u6) ...

Setting up gettext-base (0.18.1.1-9) ...

Setting up mime-support (3.52-1+deb7u1) ...

update-alternatives: using /usr/bin/see to provide /usr/bin/view (view) in auto mode

Setting up python2.7-minimal (2.7.3-6+deb7u2) ...

Setting up python2.7 (2.7.3-6+deb7u2) ...

Setting up python-minimal (2.7.3-4+deb7u1) ...

Setting up python (2.7.3-4+deb7u1) ...

Setting up python-support (1.0.15) ...

Setting up python2.6-minimal (2.6.8-1.1) ...

Setting up html2text (1.3.2a-15) ...

Setting up gettext (0.18.1.1-9) ...

Setting up intltool-debian (0.35.0+20060710.1) ...

Setting up po-debconf (1.0.16+nmu2) ...

Setting up debhelper (9.20120909) ...

Setting up python3.2-minimal (3.2.3-7) ...

Setting up python3.2 (3.2.3-7) ...

Setting up python3-minimal (3.2.3-6) ...

Setting up python3 (3.2.3-6) ...

Setting up dh-python (1.20140511-1~bpo70+1) ...

Setting up python2.6 (2.6.8-1.1) ...

Setting up python-all (2.7.3-4+deb7u1) ...

Processing triggers for python-support ...

Reading package lists...

Building dependency tree...

Reading state information...

Reading extended state information...

Initializing package states...

Writing extended state information...

-&gt; Finished parsing the build-deps

Reading package lists...

Building dependency tree...

Reading state information...

apt-utils is already the newest version.

The following NEW packages will be installed:

fakeroot

0 upgraded, 1 newly installed, 0 to remove and 0 not upgraded.

Need to get 0 B/109 kB of archives.

After this operation, 325 kB of additional disk space will be used.

Selecting previously unselected package fakeroot.

(Reading database ... 15484 files and directories currently installed.)

Unpacking fakeroot (from .../fakeroot_1.18.4-2_amd64.deb) ...

Processing triggers for man-db ...

Setting up fakeroot (1.18.4-2) ...

update-alternatives: using /usr/bin/fakeroot-sysv to provide /usr/bin/fakeroot (fakeroot) in auto mode

I: Copying back the cached apt archive contents

I: Copying source file

I: copying [/tmp/tmp4gxFoS/logilab-devtools_0.25.0-1~rev1244.dsc]

I: copying [/tmp/tmp4gxFoS/logilab-devtools_0.25.0.orig.tar.gz]

I: copying [/tmp/tmp4gxFoS/logilab-devtools_0.25.0-1~rev1244.debian.tar.xz]

I: Extracting source

dpkg-source: warning: extracting unsigned source package (logilab-devtools_0.25.0-1~rev1244.dsc)

dpkg-source: info: extracting logilab-devtools in logilab-devtools-0.25.0

dpkg-source: info: unpacking logilab-devtools_0.25.0.orig.tar.gz

dpkg-source: info: unpacking logilab-devtools_0.25.0-1~rev1244.debian.tar.xz

I: Building the package

W: no hooks of type A found -- ignoring

I: Running cd tmp/buildd/*/ &amp;&amp; env PATH=&quot;/usr/sbin:/usr/bin:/sbin:/bin&quot; dpkg-buildpackage -us -uc -rfakeroot

dpkg-buildpackage: source package logilab-devtools

dpkg-buildpackage: source version 0.25.0-1~rev1244

dpkg-buildpackage: source changed by David Douard &lt;david.douard@logilab.fr&gt;

dpkg-source --before-build logilab-devtools-0.25.0

dpkg-buildpackage: host architecture amd64

fakeroot debian/rules clean

dh clean --with python2 --buildsystem=pybuild

dh_testdir -O--buildsystem=pybuild

dh_auto_clean -O--buildsystem=pybuild

I: pybuild base:170: python2.7 setup.py clean

Traceback (most recent call last):

File &quot;setup.py&quot;, line 25, in &lt;module&gt;

from setuptools import setup, find_packages

ImportError: No module named setuptools

E: pybuild pybuild:256: clean: plugin distutils failed with: exit code=1: python2.7 setup.py clean

dh_auto_clean: pybuild --clean -i python{version} -p 2.7 2.6 --dir . returned exit code 13

make: *** [clean] Error 13

dpkg-buildpackage: error: fakeroot debian/rules clean gave error exit status 2

E: Failed autobuilding of package

I: user script /var/cache/pbuilder/build//18561/tmp/hooks/C10shell starting

[1;32mC10shell: You&#39;re entering into the image used to build the package,

because LGP_AUTO_ENTER_SHELL has been found in environment. [0;0m

TMOUT set to 1200 seconds.

Type exit or Ctrl-D (i.e. EOF) to escape.

/tmp/hooks/C10shell: line 20: /dev/tty: No such device or address

I: unmounting /sys filesystem

I: unmounting /dev filesystem

W: Could not unmount /dev: umount: /var/cache/pbuilder/build//18561//dev: target is busy

(In some cases useful info about processes that

use the device is found by lsof(8) or fuser(1).)

W: Retrying to unmount /dev in 5s

I: unmounting dev/pts filesystem

I: unmounting run/shm filesystem

I: unmounting proc filesystem

I: cleaning the build env

I: removing directory /var/cache/pbuilder/build//18561 and its subdirectories
<br/>20 printing /tmp/tmpe4cHQ6/src/29160/../jessie/logilab-devtools_0.25.0-1~rev1244_amd64_jessie.lgp-build.log: I: Using pkgname logfile

I: Current time: Mon Jun 15 23:02:23 CEST 2015

I: pbuilder-time-stamp: 1434402143

I: Obtaining the cached apt archive contents

I: Installing the build-deps

I: user script /var/cache/pbuilder/build//15794/tmp/hooks/D10tmp starting

I: user script /var/cache/pbuilder/build//15794/tmp/hooks/D10tmp finished

I: user script /var/cache/pbuilder/build//15794/tmp/hooks/D50debconf starting

I: user script /var/cache/pbuilder/build//15794/tmp/hooks/D50debconf finished

I: user script /var/cache/pbuilder/build//15794/tmp/hooks/D99apt starting

+ apt-get update

I: user script /var/cache/pbuilder/build//15794/tmp/hooks/D99apt finished

-&gt; Attempting to satisfy build-dependencies

-&gt; Creating pbuilder-satisfydepends-dummy package

Package: pbuilder-satisfydepends-dummy

Version: 0.invalid.0

Architecture: amd64

Maintainer: Debian Pbuilder Team &lt;pbuilder-maint@lists.alioth.debian.org&gt;

Description: Dummy package to satisfy dependencies with aptitude - created by pbuilder

This package was created automatically by pbuilder to satisfy the

build-dependencies of the package being currently built.

Depends: debhelper (&gt;= 9), python-all (&gt;= 2.6.5), dh-python, python-support

dpkg-deb: building package `pbuilder-satisfydepends-dummy&#39; in `/tmp/satisfydepends-aptitude/pbuilder-satisfydepends-dummy.deb&#39;.

Selecting previously unselected package pbuilder-satisfydepends-dummy.

(Reading database ... 12564 files and directories currently installed.)

Preparing to unpack .../pbuilder-satisfydepends-dummy.deb ...

Unpacking pbuilder-satisfydepends-dummy (0.invalid.0) ...

dpkg: pbuilder-satisfydepends-dummy: dependency problems, but configuring anyway as you requested:

pbuilder-satisfydepends-dummy depends on debhelper (&gt;= 9); however:

Package debhelper is not installed.

pbuilder-satisfydepends-dummy depends on python-all (&gt;= 2.6.5); however:

Package python-all is not installed.

pbuilder-satisfydepends-dummy depends on dh-python; however:

Package dh-python is not installed.

pbuilder-satisfydepends-dummy depends on python-support; however:

Package python-support is not installed.

Setting up pbuilder-satisfydepends-dummy (0.invalid.0) ...

Reading package lists...

Building dependency tree...

Reading state information...

Initializing package states...

Writing extended state information...

Building tag database...

The following NEW packages will be installed:

bsdmainutils{a} debhelper{a} dh-python{a} file{a} gettext{a}

gettext-base{a} groff-base{a} intltool-debian{a} libasprintf0c2{a}

libcroco3{a} libexpat1{a} libglib2.0-0{a} libmagic1{a} libmpdec2{a}

libpipeline1{a} libpython-stdlib{a} libpython2.7-minimal{a}

libpython2.7-stdlib{a} libpython3-stdlib{a} libpython3.4-minimal{a}

libpython3.4-stdlib{a} libunistring0{a} libxml2{a} man-db{a}

mime-support{a} po-debconf{a} python{a} python-all{a} python-minimal{a}

python-support{a} python2.7{a} python2.7-minimal{a} python3{a}

python3-minimal{a} python3.4{a} python3.4-minimal{a}

0 packages upgraded, 36 newly installed, 0 to remove and 0 not upgraded.

Need to get 0 B/17.7 MB of archives. After unpacking 62.9 MB will be used.

Writing extended state information...

Extracting templates from packages: 83%
Extracting templates from packages: 100%

Preconfiguring packages ...

E: Can not write log (Is /dev/pts mounted?) - posix_openpt (2: No such file or directory)

Selecting previously unselected package libpipeline1:amd64.

(Reading database ... 12564 files and directories currently installed.)

Preparing to unpack .../libpipeline1_1.4.0-1_amd64.deb ...

Unpacking libpipeline1:amd64 (1.4.0-1) ...

Selecting previously unselected package groff-base.

Preparing to unpack .../groff-base_1.22.2-8_amd64.deb ...

Unpacking groff-base (1.22.2-8) ...

Selecting previously unselected package bsdmainutils.

Preparing to unpack .../bsdmainutils_9.0.6_amd64.deb ...

Unpacking bsdmainutils (9.0.6) ...

Selecting previously unselected package man-db.

Preparing to unpack .../man-db_2.7.0.2-5_amd64.deb ...

Unpacking man-db (2.7.0.2-5) ...

Selecting previously unselected package libasprintf0c2:amd64.

Preparing to unpack .../libasprintf0c2_0.19.3-2_amd64.deb ...

Unpacking libasprintf0c2:amd64 (0.19.3-2) ...

Selecting previously unselected package libmagic1:amd64.

Preparing to unpack .../libmagic1_1%3a5.22+15-2_amd64.deb ...

Unpacking libmagic1:amd64 (1:5.22+15-2) ...

Selecting previously unselected package libxml2:amd64.

Preparing to unpack .../libxml2_2.9.1+dfsg1-5_amd64.deb ...

Unpacking libxml2:amd64 (2.9.1+dfsg1-5) ...

Selecting previously unselected package libpython2.7-minimal:amd64.

Preparing to unpack .../libpython2.7-minimal_2.7.9-2_amd64.deb ...

Unpacking libpython2.7-minimal:amd64 (2.7.9-2) ...

Selecting previously unselected package python2.7-minimal.

Preparing to unpack .../python2.7-minimal_2.7.9-2_amd64.deb ...

Unpacking python2.7-minimal (2.7.9-2) ...

Selecting previously unselected package python-minimal.

Preparing to unpack .../python-minimal_2.7.9-1_amd64.deb ...

Unpacking python-minimal (2.7.9-1) ...

Selecting previously unselected package mime-support.

Preparing to unpack .../mime-support_3.58_all.deb ...

Unpacking mime-support (3.58) ...

Selecting previously unselected package libexpat1:amd64.

Preparing to unpack .../libexpat1_2.1.0-6+b3_amd64.deb ...

Unpacking libexpat1:amd64 (2.1.0-6+b3) ...

Selecting previously unselected package libpython2.7-stdlib:amd64.

Preparing to unpack .../libpython2.7-stdlib_2.7.9-2_amd64.deb ...

Unpacking libpython2.7-stdlib:amd64 (2.7.9-2) ...

Selecting previously unselected package python2.7.

Preparing to unpack .../python2.7_2.7.9-2_amd64.deb ...

Unpacking python2.7 (2.7.9-2) ...

Selecting previously unselected package libpython-stdlib:amd64.

Preparing to unpack .../libpython-stdlib_2.7.9-1_amd64.deb ...

Unpacking libpython-stdlib:amd64 (2.7.9-1) ...

Setting up libpython2.7-minimal:amd64 (2.7.9-2) ...

Setting up python2.7-minimal (2.7.9-2) ...

Setting up python-minimal (2.7.9-1) ...

Selecting previously unselected package python.

(Reading database ... 13930 files and directories currently installed.)

Preparing to unpack .../python_2.7.9-1_amd64.deb ...

Unpacking python (2.7.9-1) ...

Selecting previously unselected package libglib2.0-0:amd64.

Preparing to unpack .../libglib2.0-0_2.42.1-1_amd64.deb ...

Unpacking libglib2.0-0:amd64 (2.42.1-1) ...

Selecting previously unselected package libcroco3:amd64.

Preparing to unpack .../libcroco3_0.6.8-3+b1_amd64.deb ...

Unpacking libcroco3:amd64 (0.6.8-3+b1) ...

Selecting previously unselected package libmpdec2:amd64.

Preparing to unpack .../libmpdec2_2.4.1-1_amd64.deb ...

Unpacking libmpdec2:amd64 (2.4.1-1) ...

Selecting previously unselected package libpython3.4-minimal:amd64.

Preparing to unpack .../libpython3.4-minimal_3.4.2-1_amd64.deb ...

Unpacking libpython3.4-minimal:amd64 (3.4.2-1) ...

Selecting previously unselected package libpython3.4-stdlib:amd64.

Preparing to unpack .../libpython3.4-stdlib_3.4.2-1_amd64.deb ...

Unpacking libpython3.4-stdlib:amd64 (3.4.2-1) ...

Selecting previously unselected package libunistring0:amd64.

Preparing to unpack .../libunistring0_0.9.3-5.2+b1_amd64.deb ...

Unpacking libunistring0:amd64 (0.9.3-5.2+b1) ...

Selecting previously unselected package python3.4-minimal.

Preparing to unpack .../python3.4-minimal_3.4.2-1_amd64.deb ...

Unpacking python3.4-minimal (3.4.2-1) ...

Selecting previously unselected package file.

Preparing to unpack .../file_1%3a5.22+15-2_amd64.deb ...

Unpacking file (1:5.22+15-2) ...

Selecting previously unselected package gettext-base.

Preparing to unpack .../gettext-base_0.19.3-2_amd64.deb ...

Unpacking gettext-base (0.19.3-2) ...

Selecting previously unselected package python-support.

Preparing to unpack .../python-support_1.0.15_all.deb ...

Unpacking python-support (1.0.15) ...

Selecting previously unselected package gettext.

Preparing to unpack .../gettext_0.19.3-2_amd64.deb ...

Unpacking gettext (0.19.3-2) ...

Selecting previously unselected package intltool-debian.

Preparing to unpack .../intltool-debian_0.35.0+20060710.1_all.deb ...

Unpacking intltool-debian (0.35.0+20060710.1) ...

Selecting previously unselected package po-debconf.

Preparing to unpack .../po-debconf_1.0.16+nmu3_all.deb ...

Unpacking po-debconf (1.0.16+nmu3) ...

Selecting previously unselected package debhelper.

Preparing to unpack .../debhelper_9.20150101_all.deb ...

Unpacking debhelper (9.20150101) ...

Selecting previously unselected package python3.4.

Preparing to unpack .../python3.4_3.4.2-1_amd64.deb ...

Unpacking python3.4 (3.4.2-1) ...

Selecting previously unselected package python3-minimal.

Preparing to unpack .../python3-minimal_3.4.2-2_amd64.deb ...

Unpacking python3-minimal (3.4.2-2) ...

Selecting previously unselected package libpython3-stdlib:amd64.

Preparing to unpack .../libpython3-stdlib_3.4.2-2_amd64.deb ...

Unpacking libpython3-stdlib:amd64 (3.4.2-2) ...

Selecting previously unselected package python3.

Preparing to unpack .../python3_3.4.2-2_amd64.deb ...

Unpacking python3 (3.4.2-2) ...

Selecting previously unselected package dh-python.

Preparing to unpack .../dh-python_1.20141111-2_all.deb ...

Unpacking dh-python (1.20141111-2) ...

Selecting previously unselected package python-all.

Preparing to unpack .../python-all_2.7.9-1_amd64.deb ...

Unpacking python-all (2.7.9-1) ...

Setting up libpipeline1:amd64 (1.4.0-1) ...

Setting up groff-base (1.22.2-8) ...

Setting up bsdmainutils (9.0.6) ...

update-alternatives: using /usr/bin/bsd-write to provide /usr/bin/write (write) in auto mode

update-alternatives: using /usr/bin/bsd-from to provide /usr/bin/from (from) in auto mode

Setting up man-db (2.7.0.2-5) ...

Not building database; man-db/auto-update is not &#39;true&#39;.

Setting up libasprintf0c2:amd64 (0.19.3-2) ...

Setting up libmagic1:amd64 (1:5.22+15-2) ...

Setting up libxml2:amd64 (2.9.1+dfsg1-5) ...

Setting up mime-support (3.58) ...

Setting up libexpat1:amd64 (2.1.0-6+b3) ...

Setting up libpython2.7-stdlib:amd64 (2.7.9-2) ...

Setting up python2.7 (2.7.9-2) ...

Setting up libpython-stdlib:amd64 (2.7.9-1) ...

Setting up python (2.7.9-1) ...

Setting up libglib2.0-0:amd64 (2.42.1-1) ...

No schema files found: doing nothing.

Setting up libcroco3:amd64 (0.6.8-3+b1) ...

Setting up libmpdec2:amd64 (2.4.1-1) ...

Setting up libpython3.4-minimal:amd64 (3.4.2-1) ...

Setting up libpython3.4-stdlib:amd64 (3.4.2-1) ...

Setting up libunistring0:amd64 (0.9.3-5.2+b1) ...

Setting up python3.4-minimal (3.4.2-1) ...

Setting up file (1:5.22+15-2) ...

Setting up gettext-base (0.19.3-2) ...

Setting up python-support (1.0.15) ...

Setting up gettext (0.19.3-2) ...

Setting up intltool-debian (0.35.0+20060710.1) ...

Setting up po-debconf (1.0.16+nmu3) ...

Setting up debhelper (9.20150101) ...

Setting up python3.4 (3.4.2-1) ...

Setting up python3-minimal (3.4.2-2) ...

Setting up libpython3-stdlib:amd64 (3.4.2-2) ...

Setting up python-all (2.7.9-1) ...

Setting up dh-python (1.20141111-2) ...

Setting up python3 (3.4.2-2) ...

Processing triggers for libc-bin (2.19-18) ...

Reading package lists...

Building dependency tree...

Reading state information...

Reading extended state information...

Initializing package states...

Writing extended state information...

Building tag database...

-&gt; Finished parsing the build-deps

Reading package lists...

Building dependency tree...

Reading state information...

apt-utils is already the newest version.

The following NEW packages will be installed:

fakeroot libfakeroot

0 upgraded, 2 newly installed, 0 to remove and 0 not upgraded.

Need to get 0 B/129 kB of archives.

After this operation, 434 kB of additional disk space will be used.

E: Can not write log (Is /dev/pts mounted?) - posix_openpt (2: No such file or directory)

Selecting previously unselected package libfakeroot:amd64.

(Reading database ... 15783 files and directories currently installed.)

Preparing to unpack .../libfakeroot_1.20.2-1_amd64.deb ...

Unpacking libfakeroot:amd64 (1.20.2-1) ...

Selecting previously unselected package fakeroot.

Preparing to unpack .../fakeroot_1.20.2-1_amd64.deb ...

Unpacking fakeroot (1.20.2-1) ...

Processing triggers for man-db (2.7.0.2-5) ...

Not building database; man-db/auto-update is not &#39;true&#39;.

Setting up libfakeroot:amd64 (1.20.2-1) ...

Setting up fakeroot (1.20.2-1) ...

update-alternatives: using /usr/bin/fakeroot-sysv to provide /usr/bin/fakeroot (fakeroot) in auto mode

I: Copying back the cached apt archive contents

I: Copying source file

I: copying [/tmp/tmp_EZUJg/logilab-devtools_0.25.0-1~rev1244.dsc]

I: copying [/tmp/tmp_EZUJg/logilab-devtools_0.25.0.orig.tar.gz]

I: copying [/tmp/tmp_EZUJg/logilab-devtools_0.25.0-1~rev1244.debian.tar.xz]

I: Extracting source

dpkg-source: warning: extracting unsigned source package (logilab-devtools_0.25.0-1~rev1244.dsc)

dpkg-source: info: extracting logilab-devtools in logilab-devtools-0.25.0

dpkg-source: info: unpacking logilab-devtools_0.25.0.orig.tar.gz

dpkg-source: info: unpacking logilab-devtools_0.25.0-1~rev1244.debian.tar.xz

I: Building the package

W: no hooks of type A found -- ignoring

I: Running cd tmp/buildd/*/ &amp;&amp; env PATH=&quot;/usr/sbin:/usr/bin:/sbin:/bin&quot; dpkg-buildpackage -us -uc -rfakeroot

dpkg-buildpackage: source package logilab-devtools

dpkg-buildpackage: source version 0.25.0-1~rev1244

dpkg-buildpackage: source distribution jessie

dpkg-buildpackage: source changed by David Douard &lt;david.douard@logilab.fr&gt;

dpkg-source --before-build logilab-devtools-0.25.0

dpkg-buildpackage: host architecture amd64

fakeroot debian/rules clean

dh clean --with python2 --buildsystem=pybuild

dh_testdir -O--buildsystem=pybuild

dh_auto_clean -O--buildsystem=pybuild

I: pybuild base:170: python2.7 setup.py clean

Traceback (most recent call last):

File &quot;setup.py&quot;, line 25, in &lt;module&gt;

from setuptools import setup, find_packages

ImportError: No module named setuptools

E: pybuild pybuild:256: clean: plugin distutils failed with: exit code=1: python2.7 setup.py clean

dh_auto_clean: pybuild --clean -i python{version} -p 2.7 --dir . returned exit code 13

debian/rules:15: recipe for target &#39;clean&#39; failed

make: *** [clean] Error 13

dpkg-buildpackage: error: fakeroot debian/rules clean gave error exit status 2

E: Failed autobuilding of package

I: user script /var/cache/pbuilder/build//15794/tmp/hooks/C10shell starting

[1;32mC10shell: You&#39;re entering into the image used to build the package,

because LGP_AUTO_ENTER_SHELL has been found in environment. [0;0m

TMOUT set to 1200 seconds.

Type exit or Ctrl-D (i.e. EOF) to escape.

/tmp/hooks/C10shell: line 20: /dev/tty: No such device or address

I: unmounting /sys filesystem

I: unmounting /dev filesystem

W: Could not unmount /dev: umount: /var/cache/pbuilder/build//15794//dev: target is busy

(In some cases useful info about processes that

use the device is found by lsof(8) or fuser(1).)

W: Retrying to unmount /dev in 5s

E: Can not write log (Is /dev/pts mounted?) - posix_openpt (2: No such file or directory)

Not building database; man-db/auto-update is not &#39;true&#39;.

I: unmounting dev/pts filesystem

I: unmounting run/shm filesystem

I: unmounting proc filesystem

I: cleaning the build env

I: removing directory /var/cache/pbuilder/build//15794 and its subdirectories
<br/>20 printing /tmp/tmpe4cHQ6/src/29160/../utopic/logilab-devtools_0.25.0-1~rev1244_amd64_utopic.lgp-build.log: I: Using pkgname logfile

I: Current time: Mon Jun 15 23:03:58 CEST 2015

I: pbuilder-time-stamp: 1434402238

I: Obtaining the cached apt archive contents

I: Installing the build-deps

I: user script /var/cache/pbuilder/build//19865/tmp/hooks/D10tmp starting

I: user script /var/cache/pbuilder/build//19865/tmp/hooks/D10tmp finished

I: user script /var/cache/pbuilder/build//19865/tmp/hooks/D50debconf starting

I: user script /var/cache/pbuilder/build//19865/tmp/hooks/D50debconf finished

I: user script /var/cache/pbuilder/build//19865/tmp/hooks/D99apt starting

+ apt-get update

I: user script /var/cache/pbuilder/build//19865/tmp/hooks/D99apt finished

-&gt; Attempting to satisfy build-dependencies

-&gt; Creating pbuilder-satisfydepends-dummy package

Package: pbuilder-satisfydepends-dummy

Version: 0.invalid.0

Architecture: amd64

Maintainer: Debian Pbuilder Team &lt;pbuilder-maint@lists.alioth.debian.org&gt;

Description: Dummy package to satisfy dependencies with aptitude - created by pbuilder

This package was created automatically by pbuilder to satisfy the

build-dependencies of the package being currently built.

Depends: debhelper (&gt;= 9), python-all (&gt;= 2.6.5), dh-python, python-support

dpkg-deb: building package `pbuilder-satisfydepends-dummy&#39; in `/tmp/satisfydepends-aptitude/pbuilder-satisfydepends-dummy.deb&#39;.

Selecting previously unselected package pbuilder-satisfydepends-dummy.

(Reading database ... 11956 files and directories currently installed.)

Preparing to unpack .../pbuilder-satisfydepends-dummy.deb ...

Unpacking pbuilder-satisfydepends-dummy (0.invalid.0) ...

dpkg: pbuilder-satisfydepends-dummy: dependency problems, but configuring anyway as you requested:

pbuilder-satisfydepends-dummy depends on debhelper (&gt;= 9); however:

Package debhelper is not installed.

pbuilder-satisfydepends-dummy depends on python-all (&gt;= 2.6.5); however:

Package python-all is not installed.

pbuilder-satisfydepends-dummy depends on dh-python; however:

Package dh-python is not installed.

pbuilder-satisfydepends-dummy depends on python-support; however:

Package python-support is not installed.

Setting up pbuilder-satisfydepends-dummy (0.invalid.0) ...

Reading package lists...

Building dependency tree...

Reading state information...

Initializing package states...

Writing extended state information...

Building tag database...

The following NEW packages will be installed:

bsdmainutils{a} debhelper{a} dh-apparmor{a} dh-python{a} file{a}

gettext{a} gettext-base{a} groff-base{a} intltool-debian{a}

libasprintf0c2{a} libcroco3{a} libexpat1{a} libffi6{a} libglib2.0-0{a}

libmagic1{a} libmpdec2{a} libpipeline1{a} libpython-stdlib{a}

libpython2.7-minimal{a} libpython2.7-stdlib{a} libpython3-stdlib{a}

libpython3.4-minimal{a} libpython3.4-stdlib{a} libunistring0{a}

libxml2{a} man-db{a} mime-support{a} po-debconf{a} python{a}

python-all{a} python-minimal{a} python-support{a} python2.7{a}

python2.7-minimal{a} python3{a} python3-minimal{a} python3.4{a}

python3.4-minimal{a}

0 packages upgraded, 38 newly installed, 0 to remove and 1 not upgraded.

Need to get 0 B/14.8 MB of archives. After unpacking 59.4 MB will be used.

Writing extended state information...

Extracting templates from packages: 78%
Extracting templates from packages: 100%

Preconfiguring packages ...

Selecting previously unselected package libexpat1:amd64.

(Reading database ... 11956 files and directories currently installed.)

Preparing to unpack .../libexpat1_2.1.0-6ubuntu1_amd64.deb ...

Unpacking libexpat1:amd64 (2.1.0-6ubuntu1) ...

Selecting previously unselected package libffi6:amd64.

Preparing to unpack .../libffi6_3.1-2_amd64.deb ...

Unpacking libffi6:amd64 (3.1-2) ...

Selecting previously unselected package libmagic1:amd64.

Preparing to unpack .../libmagic1_1%3a5.19-1ubuntu1.2_amd64.deb ...

Unpacking libmagic1:amd64 (1:5.19-1ubuntu1.2) ...

Selecting previously unselected package libmpdec2:amd64.

Preparing to unpack .../libmpdec2_2.4.1-1_amd64.deb ...

Unpacking libmpdec2:amd64 (2.4.1-1) ...

Selecting previously unselected package libpython3.4-minimal:amd64.

Preparing to unpack .../libpython3.4-minimal_3.4.2-1_amd64.deb ...

Unpacking libpython3.4-minimal:amd64 (3.4.2-1) ...

Selecting previously unselected package mime-support.

Preparing to unpack .../mime-support_3.55ubuntu1.1_all.deb ...

Unpacking mime-support (3.55ubuntu1.1) ...

Selecting previously unselected package libpython3.4-stdlib:amd64.

Preparing to unpack .../libpython3.4-stdlib_3.4.2-1_amd64.deb ...

Unpacking libpython3.4-stdlib:amd64 (3.4.2-1) ...

Selecting previously unselected package python3.4-minimal.

Preparing to unpack .../python3.4-minimal_3.4.2-1_amd64.deb ...

Unpacking python3.4-minimal (3.4.2-1) ...

Selecting previously unselected package libasprintf0c2:amd64.

Preparing to unpack .../libasprintf0c2_0.19.2-2ubuntu1_amd64.deb ...

Unpacking libasprintf0c2:amd64 (0.19.2-2ubuntu1) ...

Selecting previously unselected package libglib2.0-0:amd64.

Preparing to unpack .../libglib2.0-0_2.42.1-1~ubuntu1_amd64.deb ...

Unpacking libglib2.0-0:amd64 (2.42.1-1~ubuntu1) ...

Selecting previously unselected package libpipeline1:amd64.

Preparing to unpack .../libpipeline1_1.3.1-1_amd64.deb ...

Unpacking libpipeline1:amd64 (1.3.1-1) ...

Selecting previously unselected package libxml2:amd64.

Preparing to unpack .../libxml2_2.9.1+dfsg1-4ubuntu1_amd64.deb ...

Unpacking libxml2:amd64 (2.9.1+dfsg1-4ubuntu1) ...

Selecting previously unselected package groff-base.

Preparing to unpack .../groff-base_1.22.2-8_amd64.deb ...

Unpacking groff-base (1.22.2-8) ...

Selecting previously unselected package bsdmainutils.

Preparing to unpack .../bsdmainutils_9.0.5ubuntu1_amd64.deb ...

Unpacking bsdmainutils (9.0.5ubuntu1) ...

Selecting previously unselected package man-db.

Preparing to unpack .../man-db_2.7.0.2-2_amd64.deb ...

Unpacking man-db (2.7.0.2-2) ...

Selecting previously unselected package libcroco3:amd64.

Preparing to unpack .../libcroco3_0.6.8-3_amd64.deb ...

Unpacking libcroco3:amd64 (0.6.8-3) ...

Selecting previously unselected package libunistring0:amd64.

Preparing to unpack .../libunistring0_0.9.3-5ubuntu3_amd64.deb ...

Unpacking libunistring0:amd64 (0.9.3-5ubuntu3) ...

Selecting previously unselected package libpython2.7-minimal:amd64.

Preparing to unpack .../libpython2.7-minimal_2.7.8-10ubuntu1_amd64.deb ...

Unpacking libpython2.7-minimal:amd64 (2.7.8-10ubuntu1) ...

Selecting previously unselected package python2.7-minimal.

Preparing to unpack .../python2.7-minimal_2.7.8-10ubuntu1_amd64.deb ...

Unpacking python2.7-minimal (2.7.8-10ubuntu1) ...

Selecting previously unselected package python3.4.

Preparing to unpack .../python3.4_3.4.2-1_amd64.deb ...

Unpacking python3.4 (3.4.2-1) ...

Selecting previously unselected package python3-minimal.

Preparing to unpack .../python3-minimal_3.4.2-1_amd64.deb ...

Unpacking python3-minimal (3.4.2-1) ...

Selecting previously unselected package libpython3-stdlib:amd64.

Preparing to unpack .../libpython3-stdlib_3.4.2-1_amd64.deb ...

Unpacking libpython3-stdlib:amd64 (3.4.2-1) ...

Selecting previously unselected package python3.

Preparing to unpack .../python3_3.4.2-1_amd64.deb ...

Unpacking python3 (3.4.2-1) ...

Selecting previously unselected package dh-python.

Preparing to unpack .../dh-python_1.20140511-1_all.deb ...

Unpacking dh-python (1.20140511-1) ...

Selecting previously unselected package file.

Preparing to unpack .../file_1%3a5.19-1ubuntu1.2_amd64.deb ...

Unpacking file (1:5.19-1ubuntu1.2) ...

Selecting previously unselected package gettext-base.

Preparing to unpack .../gettext-base_0.19.2-2ubuntu1_amd64.deb ...

Unpacking gettext-base (0.19.2-2ubuntu1) ...

Selecting previously unselected package gettext.

Preparing to unpack .../gettext_0.19.2-2ubuntu1_amd64.deb ...

Unpacking gettext (0.19.2-2ubuntu1) ...

Selecting previously unselected package intltool-debian.

Preparing to unpack .../intltool-debian_0.35.0+20060710.1_all.deb ...

Unpacking intltool-debian (0.35.0+20060710.1) ...

Selecting previously unselected package po-debconf.

Preparing to unpack .../po-debconf_1.0.16+nmu3_all.deb ...

Unpacking po-debconf (1.0.16+nmu3) ...

Selecting previously unselected package dh-apparmor.

Preparing to unpack .../dh-apparmor_2.8.98-0ubuntu2_all.deb ...

Unpacking dh-apparmor (2.8.98-0ubuntu2) ...

Selecting previously unselected package debhelper.

Preparing to unpack .../debhelper_9.20140613ubuntu2_all.deb ...

Unpacking debhelper (9.20140613ubuntu2) ...

Selecting previously unselected package libpython2.7-stdlib:amd64.

Preparing to unpack .../libpython2.7-stdlib_2.7.8-10ubuntu1_amd64.deb ...

Unpacking libpython2.7-stdlib:amd64 (2.7.8-10ubuntu1) ...

Selecting previously unselected package libpython-stdlib:amd64.

Preparing to unpack .../libpython-stdlib_2.7.8-1_amd64.deb ...

Unpacking libpython-stdlib:amd64 (2.7.8-1) ...

Selecting previously unselected package python2.7.

Preparing to unpack .../python2.7_2.7.8-10ubuntu1_amd64.deb ...

Unpacking python2.7 (2.7.8-10ubuntu1) ...

Selecting previously unselected package python-minimal.

Preparing to unpack .../python-minimal_2.7.8-1_amd64.deb ...

Unpacking python-minimal (2.7.8-1) ...

Selecting previously unselected package python.

Preparing to unpack .../python_2.7.8-1_amd64.deb ...

Unpacking python (2.7.8-1) ...

Selecting previously unselected package python-all.

Preparing to unpack .../python-all_2.7.8-1_amd64.deb ...

Unpacking python-all (2.7.8-1) ...

Selecting previously unselected package python-support.

Preparing to unpack .../python-support_1.0.15_all.deb ...

Unpacking python-support (1.0.15) ...

Setting up libexpat1:amd64 (2.1.0-6ubuntu1) ...

Setting up libffi6:amd64 (3.1-2) ...

Setting up libmagic1:amd64 (1:5.19-1ubuntu1.2) ...

Setting up libmpdec2:amd64 (2.4.1-1) ...

Setting up libpython3.4-minimal:amd64 (3.4.2-1) ...

Setting up mime-support (3.55ubuntu1.1) ...

Setting up libpython3.4-stdlib:amd64 (3.4.2-1) ...

Setting up python3.4-minimal (3.4.2-1) ...

Setting up libasprintf0c2:amd64 (0.19.2-2ubuntu1) ...

Setting up libglib2.0-0:amd64 (2.42.1-1~ubuntu1) ...

No schema files found: doing nothing.

Setting up libpipeline1:amd64 (1.3.1-1) ...

Setting up libxml2:amd64 (2.9.1+dfsg1-4ubuntu1) ...

Setting up groff-base (1.22.2-8) ...

Setting up bsdmainutils (9.0.5ubuntu1) ...

update-alternatives: using /usr/bin/bsd-write to provide /usr/bin/write (write) in auto mode

update-alternatives: using /usr/bin/bsd-from to provide /usr/bin/from (from) in auto mode

Setting up man-db (2.7.0.2-2) ...

Not building database; man-db/auto-update is not &#39;true&#39;.

Setting up libcroco3:amd64 (0.6.8-3) ...

Setting up libunistring0:amd64 (0.9.3-5ubuntu3) ...

Setting up libpython2.7-minimal:amd64 (2.7.8-10ubuntu1) ...

Setting up python2.7-minimal (2.7.8-10ubuntu1) ...

Setting up python3.4 (3.4.2-1) ...

Setting up python3-minimal (3.4.2-1) ...

Setting up libpython3-stdlib:amd64 (3.4.2-1) ...

Setting up file (1:5.19-1ubuntu1.2) ...

Setting up gettext-base (0.19.2-2ubuntu1) ...

Setting up gettext (0.19.2-2ubuntu1) ...

Setting up intltool-debian (0.35.0+20060710.1) ...

Setting up po-debconf (1.0.16+nmu3) ...

Setting up dh-apparmor (2.8.98-0ubuntu2) ...

Setting up debhelper (9.20140613ubuntu2) ...

Setting up libpython2.7-stdlib:amd64 (2.7.8-10ubuntu1) ...

Setting up libpython-stdlib:amd64 (2.7.8-1) ...

Setting up python2.7 (2.7.8-10ubuntu1) ...

Setting up python-minimal (2.7.8-1) ...

Setting up python (2.7.8-1) ...

Setting up python-all (2.7.8-1) ...

Setting up python-support (1.0.15) ...

Setting up python3 (3.4.2-1) ...

Setting up dh-python (1.20140511-1) ...

Processing triggers for libc-bin (2.19-10ubuntu2.3) ...

Reading package lists...

Building dependency tree...

Reading state information...

Reading extended state information...

Initializing package states...

Writing extended state information...

Building tag database...

-&gt; Finished parsing the build-deps

Reading package lists...

Building dependency tree...

Reading state information...

apt-utils is already the newest version.

The following NEW packages will be installed:

fakeroot libfakeroot

0 upgraded, 2 newly installed, 0 to remove and 1 not upgraded.

Need to get 0 B/80.7 kB of archives.

After this operation, 415 kB of additional disk space will be used.

Selecting previously unselected package libfakeroot:amd64.

(Reading database ... 14962 files and directories currently installed.)

Preparing to unpack .../libfakeroot_1.20-3ubuntu3_amd64.deb ...

Unpacking libfakeroot:amd64 (1.20-3ubuntu3) ...

Selecting previously unselected package fakeroot.

Preparing to unpack .../fakeroot_1.20-3ubuntu3_amd64.deb ...

Unpacking fakeroot (1.20-3ubuntu3) ...

Processing triggers for man-db (2.7.0.2-2) ...

Not building database; man-db/auto-update is not &#39;true&#39;.

Setting up libfakeroot:amd64 (1.20-3ubuntu3) ...

Setting up fakeroot (1.20-3ubuntu3) ...

update-alternatives: using /usr/bin/fakeroot-sysv to provide /usr/bin/fakeroot (fakeroot) in auto mode

I: Copying back the cached apt archive contents

I: Copying source file

I: copying [/tmp/tmpl0bB__/logilab-devtools_0.25.0-1~rev1244.dsc]

I: copying [/tmp/tmpl0bB__/logilab-devtools_0.25.0.orig.tar.gz]

I: copying [/tmp/tmpl0bB__/logilab-devtools_0.25.0-1~rev1244.debian.tar.xz]

I: Extracting source

dpkg-source: warning: extracting unsigned source package (logilab-devtools_0.25.0-1~rev1244.dsc)

dpkg-source: info: extracting logilab-devtools in logilab-devtools-0.25.0

dpkg-source: info: unpacking logilab-devtools_0.25.0.orig.tar.gz

dpkg-source: info: unpacking logilab-devtools_0.25.0-1~rev1244.debian.tar.xz

I: Building the package

W: no hooks of type A found -- ignoring

I: Running cd tmp/buildd/*/ &amp;&amp; env PATH=&quot;/usr/sbin:/usr/bin:/sbin:/bin&quot; dpkg-buildpackage -us -uc -rfakeroot

dpkg-buildpackage: source package logilab-devtools

dpkg-buildpackage: source version 0.25.0-1~rev1244

dpkg-buildpackage: source distribution utopic

dpkg-buildpackage: source changed by David Douard &lt;david.douard@logilab.fr&gt;

dpkg-source --before-build logilab-devtools-0.25.0

dpkg-buildpackage: host architecture amd64

fakeroot debian/rules clean

dh clean --with python2 --buildsystem=pybuild

dh_testdir -O--buildsystem=pybuild

dh_auto_clean -O--buildsystem=pybuild

I: pybuild base:170: python2.7 setup.py clean

Traceback (most recent call last):

File &quot;setup.py&quot;, line 25, in &lt;module&gt;

from setuptools import setup, find_packages

ImportError: No module named setuptools

E: pybuild pybuild:256: clean: plugin distutils failed with: exit code=1: python2.7 setup.py clean

dh_auto_clean: pybuild --clean -i python{version} -p 2.7 --dir . returned exit code 13

debian/rules:15: recipe for target &#39;clean&#39; failed

make: *** [clean] Error 13

dpkg-buildpackage: error: fakeroot debian/rules clean gave error exit status 2

E: Failed autobuilding of package

I: user script /var/cache/pbuilder/build//19865/tmp/hooks/C10shell starting

[1;32mC10shell: You&#39;re entering into the image used to build the package,

because LGP_AUTO_ENTER_SHELL has been found in environment. [0;0m

TMOUT set to 1200 seconds.

Type exit or Ctrl-D (i.e. EOF) to escape.

/tmp/hooks/C10shell: line 20: /dev/tty: No such device or address

I: unmounting /sys filesystem

I: unmounting /dev filesystem

W: Could not unmount /dev: umount: /var/cache/pbuilder/build//19865//dev: target is busy

(In some cases useful info about processes that

use the device is found by lsof(8) or fuser(1).)

W: Retrying to unmount /dev in 5s

Not building database; man-db/auto-update is not &#39;true&#39;.

I: unmounting dev/pts filesystem

I: unmounting run/shm filesystem

I: unmounting proc filesystem

I: cleaning the build env

I: removing directory /var/cache/pbuilder/build//19865 and its subdirectories
<br/>

log from execution